{"text_format":"1","workbook":"xlsx","n_sheets":28,"sheets":["表紙","判別法","事前相談入力シート","事前相談チェックシート","事前相談書","様式－Ａ","様式－Ｂ","様式－Ｃ","様式－Ｄ","様式－E","コントロールシート（貯留＋浸透）","様式－Ｆ－①","ピーク流量算定表","施設諸元（自然調節）","比浸透量","施設諸元（浸透）","施設諸元（浸透_道路管理者用）","調節計算結果","許可申請書","県条例)様式第1号","計画説明書","条例)計画説明書","mkrain","runoff","逐次計算（概算）","浸透計算","逐次計算（浸透考慮）","調節計算（自然調節方式）"],"not_rendered":{"charts":1,"images":5,"macros":1,"external_links":0,"defined_names":19,"comments":0,"pivot_tables":0},"unopened":[],"bounds":{"document_bytes":16777216,"sheet_cells":100000,"rows_first":2000,"rows_last":500,"rows_between":2000,"halvings":0,"cell_chars":16384,"cell_head_chars":4096},"cells_cut":0,"cells_raw":0,"read":"whole","date_system":"1900"}

{"sheet":"表紙","index":0,"n_rows":45,"n_cols":7,"rows_kept":45,"cut":false,"hidden":false,"merged":[[44,6,48,24],[10,1,11,29],[13,4,14,26]]}
[]
[]
[]
[]
[]
[]
[]
[]
[]
[]
[null,"【中川・綾瀬川流域（埼玉県版）】調整池容量計算システム"]
[]
[]
[]
[]
[]
[]
[]
[]
[]
[]
[]
[]
[]
[]
[]
[]
[]
[]
[]
[]
[]
[]
[]
[]
[]
[]
[]
[]
[]
[]
[]
[]
[]
[null,null,null,null,null,null,"令和７年３月\n\n中川・綾瀬川流域水害対策協議会"]

{"sheet":"判別法","index":1,"n_rows":0,"n_cols":0,"rows_kept":0,"cut":false,"hidden":false,"merged":[]}

{"sheet":"事前相談入力シート","index":2,"n_rows":54,"n_cols":24,"rows_kept":54,"cut":false,"hidden":false,"merged":[[1,4,1,11],[5,19,11,19],[5,20,11,20],[5,18,11,18],[3,13,4,14],[3,15,4,17],[5,4,11,4],[5,5,11,5],[3,2,4,12],[5,11,11,11],[5,12,11,12],[5,6,11,6],[5,7,11,7],[5,8,11,8],[2,1,2,20],[5,2,11,2],[53,16,55,20],[28,20,34,20],[46,2,46,20],[26,15,27,17],[26,18,27,20],[28,2,34,2],[28,3,34,3],[28,4,34,4],[28,5,34,5],[28,6,34,6],[28,10,34,10],[28,11,34,11],[28,13,34,13],[26,2,27,12],[50,16,50,20],[51,16,52,20],[26,1,34,1],[26,13,27,14],[28,14,34,14],[28,15,34,15],[28,16,34,16],[3,18,4,20],[28,19,34,19],[28,7,34,7],[28,8,34,8],[28,9,34,9],[28,17,34,17],[28,18,34,18],[5,3,11,3],[23,2,23,20],[5,16,11,16],[3,1,11,1],[46,21,46,22],[28,21,34,21],[28,22,34,22],[25,1,25,22],[26,21,27,22],[28,12,34,12],[5,17,11,17],[5,9,11,9],[5,10,11,10],[5,13,11,13],[5,14,11,14],[5,15,11,15]]}
[]
[null,"事前相談入力シート",null,null,"法第３０条の対策の対象とする面積に対して入力してください（※）",null,null,null,null,null,null,null,null,null,null,null,null,null,null,null,null,null,null,"【提出様式】"]
[null,"現況土地利用(ha) 【行為前】"]
[null,"エリアNo","宅地等",null,null,null,null,null,null,null,null,null,null,"舗装された土地",null,"その他土地からの流出雨水量を増加させるおそれのある行為に係る土地",null,null,"左記以外の土地"]
[]
[null,null,"宅地","池沼","水路","ため池","道路（法面を有しないものに限る。）","道路（法面を有するものに限る。）","鉄道線路（法面を有しないものに限る。）","鉄道線路（法面を有するものに限る。）","飛行場（法面を有しないものに限る。）","飛行場（法面を有するものに限る。）","太陽光\nパネル","コンクリート等の不浸透性の材料により覆われた土地（法面を除く）","コンクリート等の不浸透性の材料により覆われた法面","ゴルフ場（雨水を排除するための排水施設を伴うもの）","運動場その他これに類する施設（雨水を排除するための排水施設を伴うものに限る）","ローラーその他これに類する建設機械を用いて締め固められた土地","山地","人工的に造成された植生に覆われた法面","林地、耕地、原野その他ローラーその他これに類する建設機械を用いていない土地"]
[]
[]
[]
[]
[]
[]
[null,"①",1,null,null,null,null,null,null,null,null,null,null,null,null,null,null,null,null,null,1]
[null,"②"]
[null,"③"]
[null,"④"]
[null,"⑤"]
[null,"⑥"]
[null,"⑦"]
[null,"⑧"]
[null,"⑨"]
[null,"⑩"]
[null,"小計",{"$f":"SUM(C13:C22)","v":1},0,0,0,0,0,0,0,0,0,0,0,0,0,0,0,0,0,1]
[null,"合　計",{"$f":"SUM(C23:U23)","v":2}]
[]
[null,"計画土地利用(ha) 【行為後】"]
[null,"エリアNo","宅地等",null,null,null,null,null,null,null,null,null,null,"舗装された土地",null,"その他土地からの流出雨水量を増加させるおそれのある行為に係る土地",null,null,"左記以外の土地",null,null,"埼玉県雨水流出抑制施設の設置等に関する条例に関する除外区域"]
[]
[null,null,"宅地","池沼","水路","ため池","道路（法面を有しないものに限る。）","道路（法面を有するものに限る。）","鉄道線路（法面を有しないものに限る。）","鉄道線路（法面を有するものに限る。）","飛行場（法面を有しないものに限る。）","飛行場（法面を有するものに限る。）","太陽光\nパネル","コンクリート等の不浸透性の材料により覆われた土地（法面を除く）","コンクリート等の不浸透性の材料により覆われた法面","ゴルフ場（雨水を排除するための排水施設を伴うもの）","運動場その他これに類する施設（雨水を排除するための排水施設を伴うものに限る）","ローラーその他これに類する建設機械を用いて締め固められた土地","山地","人工的に造成された植生に覆われた法面","林地、耕地、原野その他ローラーその他これに類する建設機械を用いていない土地","生産緑地法に基づく緑地","森林法に基づく残置森林"]
[]
[]
[]
[]
[]
[]
[null,"①",2]
[null,"②"]
[null,"③"]
[null,"④"]
[null,"⑤"]
[null,"⑥"]
[null,"⑦"]
[null,"⑧"]
[null,"⑨"]
[null,"⑩"]
[null,"小計",{"$f":"SUM(C36:C45)","v":2},0,0,0,0,0,0,0,0,0,0,0,0,0,0,0,0,0,0,{"$f":"SUM(V36:V45)","v":0},{"$f":"SUM(W36:W45)","v":0}]
[null,"合　計",{"$f":"SUM(C46:U46)","v":2},null,null,null,null,null,null,null,null,null,null,null,null,null,null,null,null,null,null,{"$f":"SUM(V46:W46)","v":0}]
[]
[]
[]
[null,null,null,null,null,null,null,null,null,null,null,null,null,null,null,null,"入力データの整合チェック"]
[null,null,null,null,null,null,null,null,null,null,null,null,null,null,null,null,{"$f":"IF(C24=C47,IF(C24<>0,\"OK\",\"NG\"),\"NG\")","v":"OK"}]
[]
[null,null,null,null,null,null,null,null,null,null,null,null,null,null,null,null,{"$f":"IF(Q52=\"NG\",\"開発前後の面積が異なるか、面積が未入力です。\",\"\")","v":""}]

{"sheet":"事前相談チェックシート","index":3,"n_rows":30,"n_cols":28,"rows_kept":30,"cut":false,"hidden":false,"merged":[[29,9,29,14],[28,1,28,9],[17,16,17,18],[27,1,27,9],[19,1,22,2],[19,3,19,9],[20,3,20,9],[21,3,21,9],[23,1,26,2],[23,3,23,9],[22,3,22,9],[24,3,24,9],[25,3,25,9],[26,3,26,9],[5,20,5,22],[23,21,23,23],[2,16,2,18],[23,14,26,14],[23,18,23,19],[7,16,7,18],[13,20,14,22],[26,16,27,16],[26,17,27,17],[24,18,27,19],[24,20,27,20],[24,21,27,23],[2,1,3,9],[12,3,12,9],[9,3,9,9],[10,3,10,9],[11,3,11,9],[8,3,8,9],[13,3,13,9],[4,1,15,2],[16,1,18,2],[14,3,14,9],[4,3,4,9],[5,3,5,9],[6,3,6,9],[7,3,7,9],[16,3,16,9],[17,3,17,9],[15,3,15,9],[18,3,18,9]]}
[]
[null,"事前相談チェックシート",null,null,null,null,null,null,null,null,null,null,null,null,null,null,null,null,null,null,null,null,"【提出様式】"]
[null,"土　地　利　用　区　分",null,null,1.6069045212187549E+44,null,null,null,null,null,"流出係数","①現況土地利用【行為前】","②計画土地利用【行為後】","③面積差","雨水浸透阻害行為の\n該当面積",null,"各対象面積集計",null,null,null,"対象地域※２"]
[null,null,null,null,null,null,null,null,null,null,"―","面積（ha）","面積（ha）","（ha）②－①","面積（ha）③欄が\n（＋）の場合",null,"開発区域面積※１",2,"(ha)",null,"埼玉県南部",null,null,null,null,null,"埼玉県北部",0.47039999999999998]
[null,"宅地等",null,"宅　　　地",null,null,null,null,null,null,0.9,{"$f":"事前相談入力シート!C23","v":1},{"$f":"事前相談入力シート!C46","v":2},{"$f":"M5-L5","v":1},{"$f":"MAX(N5,0)","v":1},null,"法第30条の対策の対象とする面積",{"$f":"事前相談入力シート!C47","v":2},"(ha)",null,false,null,null,null,null,null,"埼玉県南部",0.43090000000000001]
[null,null,null,"池　　　沼",null,null,null,null,null,null,1,{"$f":"事前相談入力シート!D23","v":0},{"$f":"事前相談入力シート!D46","v":0},0,{"$f":"MAX(N6,0)","v":0},null,"開発区域面積から「対策の対象とならない面積」を引いた面積",{"$f":"IF(R4>=1,R4-V17,R4-V8)","v":1},"(ha)",null,"都市計画法に基づく開発指導等としての\n必要対策量(開発区域面積1ha未満)"]
[null,null,null,"水　　　路",null,null,null,null,null,null,1,{"$f":"事前相談入力シート!E23","v":0},{"$f":"事前相談入力シート!E46","v":0},0,0,null,null,null,null,null,"対策基準",null,"m3/ha"]
[null,null,null,"た  め　池",null,null,null,null,null,null,1,{"$f":"事前相談入力シート!F23","v":0},{"$f":"事前相談入力シート!F46","v":0},0,0,null,"特定都市河川浸水被害対策法\n第30条の必要対策量",null,null,null,"対策の対象とならない面積\n（控除面積）※４",null,"ha",null,null,null,null,{"$f":"IF(U4=AA4,AB4,IF(U4=AA5,AB5,IF(U4=AA6,AB6,AB7)))","v":0.43090000000000001}]
[null,null,null,"道路（法面を有しないものに限る。）",null,null,null,null,null,null,0.9,{"$f":"事前相談入力シート!G23","v":0},{"$f":"事前相談入力シート!G46","v":0},0,0,null,"調整池深さ※３",1,"m",null,"許容比流量※５",null,"m3/s/ha"]
[null,null,null,"道路（法面を有するものに限る。）",null,null,null,null,null,null,null,{"$f":"事前相談入力シート!H23","v":0},{"$f":"事前相談入力シート!H46","v":0},0,0,null,"行為前の流出係数",{"$f":"'様式－Ｄ'!F32","v":0.55000000000000004},null,null,"許容放流量※６ ⑤\n(許容比流量×集水面積)",null,"m3/s"]
[null,null,null,"鉄道線路（法面を有しないものに限る。）",null,null,null,null,null,null,0.9,{"$f":"事前相談入力シート!I23","v":0},{"$f":"事前相談入力シート!I46","v":0},0,0,null,"行為前の流出雨水量（許容放流量） ④",{"$f":"runoff!B1","v":0.47543999999999997},"m3/s",null,"オリフィス径（円・直径）",{"$f":"AA11","v":0},"m",null,null,null,0]
[null,null,null,"鉄道線路（法面を有するものに限る。）",null,null,null,null,null,null,null,{"$f":"事前相談入力シート!J23","v":0},{"$f":"事前相談入力シート!J46","v":0},0,0,null,"行為後の流出係数",{"$f":"'様式－Ｄ'!G32","v":0.9},null,null,"必要対策量 ②",{"$f":"IF(U5=TRUE,\"不要\",IF(R26=\"不要\",\"不要\",ROUND(V7*R6,0)))","v":"不要"},"m3"]
[null,null,null,"飛行場（法面を有しないものに限る。）",null,null,null,null,null,null,0.9,{"$f":"事前相談入力シート!K23","v":0},{"$f":"事前相談入力シート!K46","v":0},0,0,null,"行為後の流出雨水量（未対策）",{"$f":"runoff!C1","v":0.77800000000000002},"m3/s"]
[null,null,null,"飛行場（法面を有するものに限る。）",null,null,null,null,null,null,null,{"$f":"事前相談入力シート!L23","v":0},{"$f":"事前相談入力シート!L46","v":0},0,0,null,"オリフィス径(円・直径)",{"$f":"AA14","v":0.47699999999999998},"m",null,"都市計画法に基づく開発指導等としての\n必要対策量（開発区域面積1ha以上）\n【埼玉県雨水流出抑制施設の設置等に関する条例】",null,null,null,null,null,0.47699999999999998]
[null,null,null,"太陽光パネル",null,null,null,null,null,null,0.9,{"$f":"事前相談入力シート!M23","v":0},{"$f":"事前相談入力シート!M46","v":0},0,0,null,"haあたり必要対策量（概算）",{"$f":"AA15","v":270},"m3/ha",null,null,null,null,null,null,null,270]
[null,null,null,"小　　　計",null,null,null,null,null,null,null,{"$f":"SUM(L5:L15)","v":1},{"$f":"SUM(M5:M15)","v":2},1,{"$f":"SUM(O5:O15)","v":1},null,"必要対策量（概算） ①",{"$f":"IF(O28<0.1,\"不要\",R15*R5)","v":540},"m3",null,"対策基準（地域別調整容量）",700,"m3/ha"]
[null,"舗装された土地",null,"コンクリート等の不浸透性の材料により覆われた土地（法面を除く）",null,null,null,null,null,null,0.95,{"$f":"事前相談入力シート!N23","v":0},{"$f":"事前相談入力シート!N46","v":0},0,0,null,null,null,null,null,"対策の対象とならない面積\n（控除面積）※４",1,"ha"]
[null,null,null,"コンクリート等の不浸透性の材料により覆われた法面",null,null,null,null,null,null,1,{"$f":"事前相談入力シート!O23","v":0},{"$f":"事前相談入力シート!O46","v":0},0,0,null,"下水道等の一時放流先との協議によるもの",null,null,null,"湛水区域対策量※７",0,"m3"]
[null,null,null,"小　　　計",null,null,null,null,null,null,null,{"$f":"SUM(L17:L18)","v":0},{"$f":"SUM(M17:M18)","v":0},0,{"$f":"SUM(O17:O18)","v":0},null,"許容比流量※８",null,"m3/s/ha",null,"許容比流量※５（≦0.05）",0.05,"m3/s/ha"]
[null,"その他土地からの流出雨水量を増加させるおそれのある行為に係る土地",null,"ゴルフ場（雨水を排除するための排水施設を伴うもの）",null,null,null,null,null,null,0.5,{"$f":"事前相談入力シート!P23","v":0},{"$f":"事前相談入力シート!P46","v":0},0,0,null,"許容放流量※６ ⑦\n(許容比流量×集水面積)",null,"m3/s",null,"許容放流量※６ ⑥\n(許容比流量×集水面積)",0.1,"m3/s"]
[null,null,null,"運動場その他これに類する施設（雨水を排除するための排水施設を伴うものに限る。",null,null,null,null,null,null,0.8,{"$f":"事前相談入力シート!Q23","v":0},{"$f":"事前相談入力シート!Q46","v":0},0,0,null,null,null,null,null,"オリフィス径（円・直径）",{"$f":"AA21","v":0.219},"m",null,null,null,0.219]
[null,null,null,"ローラーその他これに類する建設機械を用いて締め固められた土地",null,null,null,null,null,null,0.5,{"$f":"事前相談入力シート!R23","v":0},{"$f":"事前相談入力シート!R46","v":0},0,0,null,null,null,null,null,"必要対策量 ③",{"$f":"IF(U5=TRUE,\"不要\",IF(R27=\"不要\",\"不要\",ROUND(V16*R6+V18,0)))","v":700},"m3"]
[null,null,null,"小　　　計",null,null,null,null,null,null,null,{"$f":"SUM(L20:L22)","v":0},{"$f":"SUM(M20:M22)","v":0},0,{"$f":"SUM(O20:O22)","v":0},null,"都市計画法の開発許可等との調整により双方の機能を兼ね備えた対策工事とする（流出抑制量が大きい方で対策）"]
[null,"上記に揚げる土地以外の土地",null,"山　　　地",null,null,null,null,null,null,0.3,{"$f":"事前相談入力シート!S23","v":0},{"$f":"事前相談入力シート!S46","v":0},0,null,null,"他法令等との調整別の対応","申請","必要対策量(m3)（概算）\n①②③を比べ大きい値",null,"許容放流量(m3/s)\n④⑤⑥⑦を比べ小さい値"]
[null,null,null,"人工的に造成された植生に覆われた法面",null,null,null,null,null,null,0.4,{"$f":"事前相談入力シート!T23","v":0},{"$f":"事前相談入力シート!T46","v":0},0,null,null,"法第30条の許可",{"$f":"IF(O28>=0.1,\"必要\",\"不要\")","v":"必要"},{"$f":"MAX(R16,V12,V22)","v":700},null,{"$f":"MIN(Z25,Z26,Z27,Z28)","v":0.1},{"$f":"MIN(AA25,AA26,AA27,AA28)","v":0.219},null,null,{"$f":"IF(S25=R16,R14,IF(S25=V12,V11,V21))","v":0.219},{"$f":"IF(R25=\"必要\",R11,99999)","v":0.47543999999999997},{"$f":"IF(R14=0,99999,IF(R25=\"必要\",R14,99999))","v":0.47699999999999998}]
[null,null,null,"林地、耕地、原野その他ローラーその他これに類する建設機械を用いていない土地",null,null,null,null,null,null,0.2,{"$f":"事前相談入力シート!U23","v":1},{"$f":"事前相談入力シート!U46","v":0},-1,null,null,{"$f":"U6","v":"都市計画法に基づく開発指導等としての\n必要対策量(開発区域面積1ha未満)"},{"$f":"IF(U5=TRUE,\"不要\",IF(AND(R4>=0.05,R4<1),\"必要\",\"不要\"))","v":"不要"},null,null,null,null,null,null,null,{"$f":"IF(V10=0,99999,IF(R26=\"必要\",V10,99999))","v":99999},{"$f":"IF(V11=0,99999,IF(R26=\"必要\",V11,99999))","v":99999}]
[null,null,null,"小　　　計",null,null,null,null,null,null,null,{"$f":"SUM(L24:L26)","v":1},{"$f":"SUM(M24:M26)","v":0},-1,null,null,{"$f":"U14","v":"都市計画法に基づく開発指導等としての\n必要対策量（開発区域面積1ha以上）\n【埼玉県雨水流出抑制施設の設置等に関する条例】"},{"$f":"IF(U5=TRUE,\"不要\",IF(R4>=1,\"必要\",\"不要\"))","v":"必要"},null,null,null,null,null,null,null,{"$f":"IF(V20=0,99999,IF(R27=\"必要\",V20,99999))","v":0.1},{"$f":"IF(V21=0,99999,IF(R27=\"必要\",V21,99999))","v":0.219}]
[null,"合　　　計",null,null,null,null,null,null,null,null,null,{"$f":"L16+L19+L23+L27","v":2},{"$f":"M16+M19+M23+M27","v":2},{"$f":"IF(ABS(M28-L28)<0.000001,\"OK\",\"NG\")","v":"OK"},{"$f":"O16+O19+O23","v":1},null,null,null,null,null,null,null,null,null,null,{"$f":"IF(R20>0,R20,99999)","v":99999},{"$f":"IF(R20=0,99999,ROUND((4*AB28/PI())^0.5,3))","v":99999},{"$f":"R20/0.6/(2*9.8*R9)^0.5","v":0}]
[null,"平均流出係数",null,null,null,null,null,null,null,null,null,{"$f":"ROUND((L5*$K5+L6*$K6+L7*$K7+L8*$K8+L9*$K9+L10*$K10+L11*$K11+L12*$K12+L13*$K13+L14*$K14+L15*$K15+L17*$K17+L18*$K18+L20*$K20+L21*$K21+L22*$K22+L24*$K24+L25*$K25+L26*$K26)/L28,3)","v":0.55000000000000004},{"$f":"ROUND((M5*$K5+M6*$K6+M7*$K7+M8*$K8+M9*$K9+M10*$K10+M11*$K11+M12*$K12+M13*$K13+M14*$K14+M15*$K15+M17*$K17+M18*$K18+M20*$K20+M21*$K21+M22*$K22+M24*$K24+M25*$K25+M26*$K26)/M28,3)","v":0.9}]
[null,null,null,null,null,null,null,null,null,"※雨水浸透阻害行為の該当面積が0.1ha以上の場合、法第30条の許可（協議）が必要です。"]

{"sheet":"事前相談書","index":4,"n_rows":25,"n_cols":32,"rows_kept":25,"cut":false,"hidden":false,"merged":[[0,12,0,13],[5,6,5,13],[17,1,18,5],[18,6,19,6],[20,6,21,6],[7,6,9,13],[10,6,12,13],[13,6,15,13],[16,6,17,6],[22,6,23,6],[20,25,21,25],[22,25,23,25],[20,7,21,13],[22,7,23,13],[24,7,24,10],[24,12,24,13],[16,25,17,25],[17,20,18,24],[18,25,19,25],[16,7,17,13],[18,7,19,13]]}
[null,null,null,null,null,null,null,null,null,null,null,null,"【提出様式】"]
[null,null,null,null,null,null,null,null,null,null,null,"№","－",null,null,null,null,null,null,null,null,null,null,null,null,null,null,null,null,null,"№","－"]
[null,"雨 水 浸 透 阻 害 行 為 事 前 相 談 書",null,null,null,null,null,null,null,null,null,null,null,null,null,null,null,null,null,null,"雨 水 浸 透 阻 害 行 為 事 前 相 談 書"]
[]
[]
[null,"事前相談日時",null,null,null,null,"　　　　　年　　月　　日（　）　：　　～　　：",null,null,null,null,null,null,null,null,null,null,null,null,null,"事前相談日時",null,null,null,null,"　　　○○年○○月○○日（○）XX：XX～　　："]
[]
[]
[null,"事業区域に含まれる地域の名称",null,null,null,null,null,null,null,null,null,null,null,null,null,null,null,null,null,null,"事業区域に含まれる地域の名称",null,null,null,null,"　○○市○○町101番地、102番地、103番地"]
[]
[null,null,null,null,null,null,{"$f":"事前相談チェックシート!R4","v":2}]
[null,"事業区域の面積",null,null,null,null,null,null,null,null,null,null,null,null,null,null,null,null,null,null,"事業区域の面積",null,null,null,null,"　0.250ha"]
[]
[]
[null,"予定する事業の計画の内容",null,null,null,null,null,null,null,null,null,null,null,null,null,null,null,null,null,null,"予定する事業の計画の内容",null,null,null,null,"　分譲住宅（１５宅地）の宅地造成"]
[]
[null,null,null,null,null,null,"住　所",null,null,null,null,null,null,null,null,null,null,null,null,null,null,null,null,null,null,"住　所"]
[null,"事業主又は建築主等の住所・氏名",null,null,null,null,null,null,null,null,null,null,null,null,null,null,null,null,null,null,"事業主又は建築主等の住所・氏名",null,null,null,null,null,null,"○○○○住宅建設株式会社"]
[null,null,null,null,null,null,"氏　名",null,null,null,null,null,null,null,null,null,null,null,null,null,null,null,null,null,null,"氏　名",null,"代表取締役　　○○　○○"]
[]
[null,null,null,null,null,null,"住　所",null,null,null,null,null,null,null,null,null,null,null,null,null,null,null,null,null,null,"住　所"]
[null,null,null,null,null,null,null,null,null,null,null,null,null,null,null,null,null,null,null,null,null,null,null,null,null,null,null,"○○市○○町１－１－１"]
[null,"代理人等の住所・氏名・連絡先",null,null,null,null,"氏　名",null,null,null,null,null,null,null,null,null,null,null,null,null,"代理人等の住所・氏名・連絡先",null,null,null,null,"氏　名",null,"○○○設計事務所株式会社"]
[]
[null,null,null,null,null,null,"連絡先",null,null,null,null,"担当者名",null,null,null,null,null,null,null,null,null,null,null,null,null,"連絡先","XXX","（XXX","）XXXX",null,"担当者名　○○"]

{"sheet":"様式－Ａ","index":5,"n_rows":25,"n_cols":20,"rows_kept":25,"cut":false,"hidden":true,"merged":[[23,1,23,19],[22,12,22,13],[22,14,22,16],[22,17,22,19],[22,1,22,11],[4,8,10,8],[4,9,10,9],[4,19,10,19],[2,17,3,19],[4,17,10,17],[4,18,10,18],[2,1,3,11],[4,11,10,11],[2,0,10,0],[2,12,3,13],[2,14,3,16],[4,10,10,10],[4,12,10,12],[4,13,10,13],[4,14,10,14],[4,15,10,15],[4,16,10,16],[4,1,10,1],[4,2,10,2],[4,3,10,3],[4,4,10,4],[4,5,10,5],[4,6,10,6],[4,7,10,7]]}
[]
["現況土地利用区分面積集計表（行為前）",null,null,null,null,null,null,null,null,null,null,null,null,null,null,null,null,null,null,"様式－Ａ"]
["エリアNo","宅地等",null,null,null,null,null,null,null,null,null,null,"舗装された土地",null,"その他土地からの流出雨水量を増加させるおそれのある行為に係る土地",null,null,"左記以外の土地"]
[]
[null,"宅地","池沼","水路","ため池","道路（法面を有しないものに限る。）","道路（法面を有するものに限る。）","鉄道線路（法面を有しないものに限る。）","鉄道線路（法面を有するものに限る。）","飛行場（法面を有しないものに限る。）","飛行場（法面を有するものに限る。）","太陽光\nパネル","コンクリート等の不浸透性の材料により覆われた土地（法面を除く）","コンクリート等の不浸透性の材料により覆われた法面","ゴルフ場（雨水を排除するための排水施設を伴うもの）","運動場その他これに類する施設（雨水を排除するための排水施設を伴うものに限る）","ローラーその他これに類する建設機械を用いて締め固められた土地","山地","人工的に造成された植生に覆われた法面","林地、耕地、原野その他ローラーその他これに類する建設機械を用いていない土地"]
[]
[]
[]
[]
[]
[]
[{"$f":"事前相談入力シート!B13","v":"①"},{"$f":"事前相談入力シート!C13","v":1},{"$f":"事前相談入力シート!D13","v":0},{"$f":"事前相談入力シート!E13","v":0},{"$f":"事前相談入力シート!F13","v":0},{"$f":"事前相談入力シート!G13","v":0},{"$f":"事前相談入力シート!H13","v":0},{"$f":"事前相談入力シート!I13","v":0},{"$f":"事前相談入力シート!J13","v":0},{"$f":"事前相談入力シート!K13","v":0},{"$f":"事前相談入力シート!L13","v":0},null,{"$f":"事前相談入力シート!N13","v":0},{"$f":"事前相談入力シート!O13","v":0},{"$f":"事前相談入力シート!P13","v":0},{"$f":"事前相談入力シート!Q13","v":0},{"$f":"事前相談入力シート!R13","v":0},{"$f":"事前相談入力シート!S13","v":0},{"$f":"事前相談入力シート!T13","v":0},{"$f":"事前相談入力シート!U13","v":1}]
[{"$f":"事前相談入力シート!B14","v":"②"},{"$f":"事前相談入力シート!C14","v":0},{"$f":"事前相談入力シート!D14","v":0},{"$f":"事前相談入力シート!E14","v":0},{"$f":"事前相談入力シート!F14","v":0},{"$f":"事前相談入力シート!G14","v":0},{"$f":"事前相談入力シート!H14","v":0},{"$f":"事前相談入力シート!I14","v":0},{"$f":"事前相談入力シート!J14","v":0},{"$f":"事前相談入力シート!K14","v":0},{"$f":"事前相談入力シート!L14","v":0},null,{"$f":"事前相談入力シート!N14","v":0},{"$f":"事前相談入力シート!O14","v":0},{"$f":"事前相談入力シート!P14","v":0},{"$f":"事前相談入力シート!Q14","v":0},{"$f":"事前相談入力シート!R14","v":0},{"$f":"事前相談入力シート!S14","v":0},{"$f":"事前相談入力シート!T14","v":0},{"$f":"事前相談入力シート!U14","v":0}]
[{"$f":"事前相談入力シート!B15","v":"③"},{"$f":"事前相談入力シート!C15","v":0},{"$f":"事前相談入力シート!D15","v":0},{"$f":"事前相談入力シート!E15","v":0},{"$f":"事前相談入力シート!F15","v":0},{"$f":"事前相談入力シート!G15","v":0},{"$f":"事前相談入力シート!H15","v":0},{"$f":"事前相談入力シート!I15","v":0},{"$f":"事前相談入力シート!J15","v":0},{"$f":"事前相談入力シート!K15","v":0},{"$f":"事前相談入力シート!L15","v":0},null,{"$f":"事前相談入力シート!N15","v":0},{"$f":"事前相談入力シート!O15","v":0},{"$f":"事前相談入力シート!P15","v":0},{"$f":"事前相談入力シート!Q15","v":0},{"$f":"事前相談入力シート!R15","v":0},{"$f":"事前相談入力シート!S15","v":0},{"$f":"事前相談入力シート!T15","v":0},{"$f":"事前相談入力シート!U15","v":0}]
[{"$f":"事前相談入力シート!B16","v":"④"},{"$f":"事前相談入力シート!C16","v":0},{"$f":"事前相談入力シート!D16","v":0},{"$f":"事前相談入力シート!E16","v":0},{"$f":"事前相談入力シート!F16","v":0},{"$f":"事前相談入力シート!G16","v":0},{"$f":"事前相談入力シート!H16","v":0},{"$f":"事前相談入力シート!I16","v":0},{"$f":"事前相談入力シート!J16","v":0},{"$f":"事前相談入力シート!K16","v":0},{"$f":"事前相談入力シート!L16","v":0},null,{"$f":"事前相談入力シート!N16","v":0},{"$f":"事前相談入力シート!O16","v":0},{"$f":"事前相談入力シート!P16","v":0},{"$f":"事前相談入力シート!Q16","v":0},{"$f":"事前相談入力シート!R16","v":0},{"$f":"事前相談入力シート!S16","v":0},{"$f":"事前相談入力シート!T16","v":0},{"$f":"事前相談入力シート!U16","v":0}]
[{"$f":"事前相談入力シート!B17","v":"⑤"},{"$f":"事前相談入力シート!C17","v":0},{"$f":"事前相談入力シート!D17","v":0},{"$f":"事前相談入力シート!E17","v":0},{"$f":"事前相談入力シート!F17","v":0},{"$f":"事前相談入力シート!G17","v":0},{"$f":"事前相談入力シート!H17","v":0},{"$f":"事前相談入力シート!I17","v":0},{"$f":"事前相談入力シート!J17","v":0},{"$f":"事前相談入力シート!K17","v":0},{"$f":"事前相談入力シート!L17","v":0},null,{"$f":"事前相談入力シート!N17","v":0},{"$f":"事前相談入力シート!O17","v":0},{"$f":"事前相談入力シート!P17","v":0},{"$f":"事前相談入力シート!Q17","v":0},{"$f":"事前相談入力シート!R17","v":0},{"$f":"事前相談入力シート!S17","v":0},{"$f":"事前相談入力シート!T17","v":0},{"$f":"事前相談入力シート!U17","v":0}]
[{"$f":"事前相談入力シート!B18","v":"⑥"},{"$f":"事前相談入力シート!C18","v":0},{"$f":"事前相談入力シート!D18","v":0},{"$f":"事前相談入力シート!E18","v":0},{"$f":"事前相談入力シート!F18","v":0},{"$f":"事前相談入力シート!G18","v":0},{"$f":"事前相談入力シート!H18","v":0},{"$f":"事前相談入力シート!I18","v":0},{"$f":"事前相談入力シート!J18","v":0},{"$f":"事前相談入力シート!K18","v":0},{"$f":"事前相談入力シート!L18","v":0},null,{"$f":"事前相談入力シート!N18","v":0},{"$f":"事前相談入力シート!O18","v":0},{"$f":"事前相談入力シート!P18","v":0},{"$f":"事前相談入力シート!Q18","v":0},{"$f":"事前相談入力シート!R18","v":0},{"$f":"事前相談入力シート!S18","v":0},{"$f":"事前相談入力シート!T18","v":0},{"$f":"事前相談入力シート!U18","v":0}]
[{"$f":"事前相談入力シート!B19","v":"⑦"},{"$f":"事前相談入力シート!C19","v":0},{"$f":"事前相談入力シート!D19","v":0},{"$f":"事前相談入力シート!E19","v":0},{"$f":"事前相談入力シート!F19","v":0},{"$f":"事前相談入力シート!G19","v":0},{"$f":"事前相談入力シート!H19","v":0},{"$f":"事前相談入力シート!I19","v":0},{"$f":"事前相談入力シート!J19","v":0},{"$f":"事前相談入力シート!K19","v":0},{"$f":"事前相談入力シート!L19","v":0},null,{"$f":"事前相談入力シート!N19","v":0},{"$f":"事前相談入力シート!O19","v":0},{"$f":"事前相談入力シート!P19","v":0},{"$f":"事前相談入力シート!Q19","v":0},{"$f":"事前相談入力シート!R19","v":0},{"$f":"事前相談入力シート!S19","v":0},{"$f":"事前相談入力シート!T19","v":0},{"$f":"事前相談入力シート!U19","v":0}]
[{"$f":"事前相談入力シート!B20","v":"⑧"},{"$f":"事前相談入力シート!C20","v":0},{"$f":"事前相談入力シート!D20","v":0},{"$f":"事前相談入力シート!E20","v":0},{"$f":"事前相談入力シート!F20","v":0},{"$f":"事前相談入力シート!G20","v":0},{"$f":"事前相談入力シート!H20","v":0},{"$f":"事前相談入力シート!I20","v":0},{"$f":"事前相談入力シート!J20","v":0},{"$f":"事前相談入力シート!K20","v":0},{"$f":"事前相談入力シート!L20","v":0},null,{"$f":"事前相談入力シート!N20","v":0},{"$f":"事前相談入力シート!O20","v":0},{"$f":"事前相談入力シート!P20","v":0},{"$f":"事前相談入力シート!Q20","v":0},{"$f":"事前相談入力シート!R20","v":0},{"$f":"事前相談入力シート!S20","v":0},{"$f":"事前相談入力シート!T20","v":0},{"$f":"事前相談入力シート!U20","v":0}]
[{"$f":"事前相談入力シート!B21","v":"⑨"},{"$f":"事前相談入力シート!C21","v":0},{"$f":"事前相談入力シート!D21","v":0},{"$f":"事前相談入力シート!E21","v":0},{"$f":"事前相談入力シート!F21","v":0},{"$f":"事前相談入力シート!G21","v":0},{"$f":"事前相談入力シート!H21","v":0},{"$f":"事前相談入力シート!I21","v":0},{"$f":"事前相談入力シート!J21","v":0},{"$f":"事前相談入力シート!K21","v":0},{"$f":"事前相談入力シート!L21","v":0},null,{"$f":"事前相談入力シート!N21","v":0},{"$f":"事前相談入力シート!O21","v":0},{"$f":"事前相談入力シート!P21","v":0},{"$f":"事前相談入力シート!Q21","v":0},{"$f":"事前相談入力シート!R21","v":0},{"$f":"事前相談入力シート!S21","v":0},{"$f":"事前相談入力シート!T21","v":0},{"$f":"事前相談入力シート!U21","v":0}]
[{"$f":"事前相談入力シート!B22","v":"⑩"},{"$f":"事前相談入力シート!C22","v":0},{"$f":"事前相談入力シート!D22","v":0},{"$f":"事前相談入力シート!E22","v":0},{"$f":"事前相談入力シート!F22","v":0},{"$f":"事前相談入力シート!G22","v":0},{"$f":"事前相談入力シート!H22","v":0},{"$f":"事前相談入力シート!I22","v":0},{"$f":"事前相談入力シート!J22","v":0},{"$f":"事前相談入力シート!K22","v":0},{"$f":"事前相談入力シート!L22","v":0},null,{"$f":"事前相談入力シート!N22","v":0},{"$f":"事前相談入力シート!O22","v":0},{"$f":"事前相談入力シート!P22","v":0},{"$f":"事前相談入力シート!Q22","v":0},{"$f":"事前相談入力シート!R22","v":0},{"$f":"事前相談入力シート!S22","v":0},{"$f":"事前相談入力シート!T22","v":0},{"$f":"事前相談入力シート!U22","v":0}]
["小計１",{"$f":"SUM(B12:B21)","v":1},0,0,0,0,0,0,0,0,0,0,0,0,0,0,0,0,0,1]
["小計２",{"$f":"SUM(B22:L22)","v":1},null,null,null,null,null,null,null,null,null,null,{"$f":"SUM(M22:N22)","v":0},null,{"$f":"SUM(O22:Q22)","v":0},null,null,{"$f":"SUM(R22:T22)","v":1}]
["合　計",{"$f":"SUM(B23:T23)","v":2}]
[null,null,null,null,null,null,null,null,null,null,null,null,null,null,null,null,null,null,"（単位：ha）"]

{"sheet":"様式－Ｂ","index":6,"n_rows":25,"n_cols":20,"rows_kept":25,"cut":false,"hidden":true,"merged":[[23,1,23,19],[22,12,22,13],[22,14,22,16],[22,17,22,19],[22,1,22,11],[4,8,10,8],[4,9,10,9],[4,19,10,19],[2,17,3,19],[4,17,10,17],[4,18,10,18],[2,1,3,11],[4,11,10,11],[2,0,10,0],[2,12,3,13],[2,14,3,16],[4,10,10,10],[4,12,10,12],[4,13,10,13],[4,14,10,14],[4,15,10,15],[4,16,10,16],[4,1,10,1],[4,2,10,2],[4,3,10,3],[4,4,10,4],[4,5,10,5],[4,6,10,6],[4,7,10,7]]}
[]
["計画土地利用区分面積集計表（行為後）",null,null,null,null,null,null,null,null,null,null,null,null,null,null,null,null,null,null,"様式－Ｂ"]
["エリアNo","宅地等",null,null,null,null,null,null,null,null,null,null,"舗装された土地",null,"その他土地からの流出雨水量を増加させるおそれのある行為に係る土地",null,null,"左記以外の土地"]
[]
[null,"宅地","池沼","水路","ため池","道路（法面を有しないものに限る。）","道路（法面を有するものに限る。）","鉄道線路（法面を有しないものに限る。）","鉄道線路（法面を有するものに限る。）","飛行場（法面を有しないものに限る。）","飛行場（法面を有するものに限る。）","太陽光\nパネル","コンクリート等の不浸透性の材料により覆われた土地（法面を除く）","コンクリート等の不浸透性の材料により覆われた法面","ゴルフ場（雨水を排除するための排水施設を伴うもの）","運動場その他これに類する施設（雨水を排除するための排水施設を伴うものに限る）","ローラーその他これに類する建設機械を用いて締め固められた土地","山地","人工的に造成された植生に覆われた法面","林地、耕地、原野その他ローラーその他これに類する建設機械を用いていない土地"]
[]
[]
[]
[]
[]
[]
[{"$f":"事前相談入力シート!B36","v":"①"},{"$f":"事前相談入力シート!C36","v":2},{"$f":"事前相談入力シート!D36","v":0},{"$f":"事前相談入力シート!E36","v":0},{"$f":"事前相談入力シート!F36","v":0},{"$f":"事前相談入力シート!G36","v":0},{"$f":"事前相談入力シート!H36","v":0},{"$f":"事前相談入力シート!I36","v":0},{"$f":"事前相談入力シート!J36","v":0},{"$f":"事前相談入力シート!K36","v":0},{"$f":"事前相談入力シート!L36","v":0},null,{"$f":"事前相談入力シート!N36","v":0},{"$f":"事前相談入力シート!O36","v":0},{"$f":"事前相談入力シート!P36","v":0},{"$f":"事前相談入力シート!Q36","v":0},{"$f":"事前相談入力シート!R36","v":0},{"$f":"事前相談入力シート!S36","v":0},{"$f":"事前相談入力シート!T36","v":0},{"$f":"事前相談入力シート!U36","v":0}]
[{"$f":"事前相談入力シート!B37","v":"②"},{"$f":"事前相談入力シート!C37","v":0},{"$f":"事前相談入力シート!D37","v":0},{"$f":"事前相談入力シート!E37","v":0},{"$f":"事前相談入力シート!F37","v":0},{"$f":"事前相談入力シート!G37","v":0},{"$f":"事前相談入力シート!H37","v":0},{"$f":"事前相談入力シート!I37","v":0},{"$f":"事前相談入力シート!J37","v":0},{"$f":"事前相談入力シート!K37","v":0},{"$f":"事前相談入力シート!L37","v":0},null,{"$f":"事前相談入力シート!N37","v":0},{"$f":"事前相談入力シート!O37","v":0},{"$f":"事前相談入力シート!P37","v":0},{"$f":"事前相談入力シート!Q37","v":0},{"$f":"事前相談入力シート!R37","v":0},{"$f":"事前相談入力シート!S37","v":0},{"$f":"事前相談入力シート!T37","v":0},{"$f":"事前相談入力シート!U37","v":0}]
[{"$f":"事前相談入力シート!B38","v":"③"},{"$f":"事前相談入力シート!C38","v":0},{"$f":"事前相談入力シート!D38","v":0},{"$f":"事前相談入力シート!E38","v":0},{"$f":"事前相談入力シート!F38","v":0},{"$f":"事前相談入力シート!G38","v":0},{"$f":"事前相談入力シート!H38","v":0},{"$f":"事前相談入力シート!I38","v":0},{"$f":"事前相談入力シート!J38","v":0},{"$f":"事前相談入力シート!K38","v":0},{"$f":"事前相談入力シート!L38","v":0},null,{"$f":"事前相談入力シート!N38","v":0},{"$f":"事前相談入力シート!O38","v":0},{"$f":"事前相談入力シート!P38","v":0},{"$f":"事前相談入力シート!Q38","v":0},{"$f":"事前相談入力シート!R38","v":0},{"$f":"事前相談入力シート!S38","v":0},{"$f":"事前相談入力シート!T38","v":0},{"$f":"事前相談入力シート!U38","v":0}]
[{"$f":"事前相談入力シート!B39","v":"④"},{"$f":"事前相談入力シート!C39","v":0},{"$f":"事前相談入力シート!D39","v":0},{"$f":"事前相談入力シート!E39","v":0},{"$f":"事前相談入力シート!F39","v":0},{"$f":"事前相談入力シート!G39","v":0},{"$f":"事前相談入力シート!H39","v":0},{"$f":"事前相談入力シート!I39","v":0},{"$f":"事前相談入力シート!J39","v":0},{"$f":"事前相談入力シート!K39","v":0},{"$f":"事前相談入力シート!L39","v":0},null,{"$f":"事前相談入力シート!N39","v":0},{"$f":"事前相談入力シート!O39","v":0},{"$f":"事前相談入力シート!P39","v":0},{"$f":"事前相談入力シート!Q39","v":0},{"$f":"事前相談入力シート!R39","v":0},{"$f":"事前相談入力シート!S39","v":0},{"$f":"事前相談入力シート!T39","v":0},{"$f":"事前相談入力シート!U39","v":0}]
[{"$f":"事前相談入力シート!B40","v":"⑤"},{"$f":"事前相談入力シート!C40","v":0},{"$f":"事前相談入力シート!D40","v":0},{"$f":"事前相談入力シート!E40","v":0},{"$f":"事前相談入力シート!F40","v":0},{"$f":"事前相談入力シート!G40","v":0},{"$f":"事前相談入力シート!H40","v":0},{"$f":"事前相談入力シート!I40","v":0},{"$f":"事前相談入力シート!J40","v":0},{"$f":"事前相談入力シート!K40","v":0},{"$f":"事前相談入力シート!L40","v":0},null,{"$f":"事前相談入力シート!N40","v":0},{"$f":"事前相談入力シート!O40","v":0},{"$f":"事前相談入力シート!P40","v":0},{"$f":"事前相談入力シート!Q40","v":0},{"$f":"事前相談入力シート!R40","v":0},{"$f":"事前相談入力シート!S40","v":0},{"$f":"事前相談入力シート!T40","v":0},{"$f":"事前相談入力シート!U40","v":0}]
[{"$f":"事前相談入力シート!B41","v":"⑥"},{"$f":"事前相談入力シート!C41","v":0},{"$f":"事前相談入力シート!D41","v":0},{"$f":"事前相談入力シート!E41","v":0},{"$f":"事前相談入力シート!F41","v":0},{"$f":"事前相談入力シート!G41","v":0},{"$f":"事前相談入力シート!H41","v":0},{"$f":"事前相談入力シート!I41","v":0},{"$f":"事前相談入力シート!J41","v":0},{"$f":"事前相談入力シート!K41","v":0},{"$f":"事前相談入力シート!L41","v":0},null,{"$f":"事前相談入力シート!N41","v":0},{"$f":"事前相談入力シート!O41","v":0},{"$f":"事前相談入力シート!P41","v":0},{"$f":"事前相談入力シート!Q41","v":0},{"$f":"事前相談入力シート!R41","v":0},{"$f":"事前相談入力シート!S41","v":0},{"$f":"事前相談入力シート!T41","v":0},{"$f":"事前相談入力シート!U41","v":0}]
[{"$f":"事前相談入力シート!B42","v":"⑦"},{"$f":"事前相談入力シート!C42","v":0},{"$f":"事前相談入力シート!D42","v":0},{"$f":"事前相談入力シート!E42","v":0},{"$f":"事前相談入力シート!F42","v":0},{"$f":"事前相談入力シート!G42","v":0},{"$f":"事前相談入力シート!H42","v":0},{"$f":"事前相談入力シート!I42","v":0},{"$f":"事前相談入力シート!J42","v":0},{"$f":"事前相談入力シート!K42","v":0},{"$f":"事前相談入力シート!L42","v":0},null,{"$f":"事前相談入力シート!N42","v":0},{"$f":"事前相談入力シート!O42","v":0},{"$f":"事前相談入力シート!P42","v":0},{"$f":"事前相談入力シート!Q42","v":0},{"$f":"事前相談入力シート!R42","v":0},{"$f":"事前相談入力シート!S42","v":0},{"$f":"事前相談入力シート!T42","v":0},{"$f":"事前相談入力シート!U42","v":0}]
[{"$f":"事前相談入力シート!B43","v":"⑧"},{"$f":"事前相談入力シート!C43","v":0},{"$f":"事前相談入力シート!D43","v":0},{"$f":"事前相談入力シート!E43","v":0},{"$f":"事前相談入力シート!F43","v":0},{"$f":"事前相談入力シート!G43","v":0},{"$f":"事前相談入力シート!H43","v":0},{"$f":"事前相談入力シート!I43","v":0},{"$f":"事前相談入力シート!J43","v":0},{"$f":"事前相談入力シート!K43","v":0},{"$f":"事前相談入力シート!L43","v":0},null,{"$f":"事前相談入力シート!N43","v":0},{"$f":"事前相談入力シート!O43","v":0},{"$f":"事前相談入力シート!P43","v":0},{"$f":"事前相談入力シート!Q43","v":0},{"$f":"事前相談入力シート!R43","v":0},{"$f":"事前相談入力シート!S43","v":0},{"$f":"事前相談入力シート!T43","v":0},{"$f":"事前相談入力シート!U43","v":0}]
[{"$f":"事前相談入力シート!B44","v":"⑨"},{"$f":"事前相談入力シート!C44","v":0},{"$f":"事前相談入力シート!D44","v":0},{"$f":"事前相談入力シート!E44","v":0},{"$f":"事前相談入力シート!F44","v":0},{"$f":"事前相談入力シート!G44","v":0},{"$f":"事前相談入力シート!H44","v":0},{"$f":"事前相談入力シート!I44","v":0},{"$f":"事前相談入力シート!J44","v":0},{"$f":"事前相談入力シート!K44","v":0},{"$f":"事前相談入力シート!L44","v":0},null,{"$f":"事前相談入力シート!N44","v":0},{"$f":"事前相談入力シート!O44","v":0},{"$f":"事前相談入力シート!P44","v":0},{"$f":"事前相談入力シート!Q44","v":0},{"$f":"事前相談入力シート!R44","v":0},{"$f":"事前相談入力シート!S44","v":0},{"$f":"事前相談入力シート!T44","v":0},{"$f":"事前相談入力シート!U44","v":0}]
[{"$f":"事前相談入力シート!B45","v":"⑩"},{"$f":"事前相談入力シート!C45","v":0},{"$f":"事前相談入力シート!D45","v":0},{"$f":"事前相談入力シート!E45","v":0},{"$f":"事前相談入力シート!F45","v":0},{"$f":"事前相談入力シート!G45","v":0},{"$f":"事前相談入力シート!H45","v":0},{"$f":"事前相談入力シート!I45","v":0},{"$f":"事前相談入力シート!J45","v":0},{"$f":"事前相談入力シート!K45","v":0},{"$f":"事前相談入力シート!L45","v":0},null,{"$f":"事前相談入力シート!N45","v":0},{"$f":"事前相談入力シート!O45","v":0},{"$f":"事前相談入力シート!P45","v":0},{"$f":"事前相談入力シート!Q45","v":0},{"$f":"事前相談入力シート!R45","v":0},{"$f":"事前相談入力シート!S45","v":0},{"$f":"事前相談入力シート!T45","v":0},{"$f":"事前相談入力シート!U45","v":0}]
["小計１",{"$f":"SUM(B12:B21)","v":2},0,0,0,0,0,0,0,0,0,0,0,0,0,0,0,0,0,0]
["小計２",{"$f":"SUM(B22:L22)","v":2},null,null,null,null,null,null,null,null,null,null,{"$f":"SUM(M22:N22)","v":0},null,{"$f":"SUM(O22:Q22)","v":0},null,null,{"$f":"SUM(R22:T22)","v":0}]
["合　計",{"$f":"SUM(B23:T23)","v":2}]
[null,null,null,null,null,null,null,null,null,null,null,null,null,null,null,null,null,null,"（単位：ha）"]

{"sheet":"様式－Ｃ","index":7,"n_rows":33,"n_cols":15,"rows_kept":33,"cut":false,"hidden":true,"merged":[[25,12,28,12],[26,2,26,8],[31,0,31,1],[31,2,31,5],[28,2,28,5],[29,0,29,1],[29,2,29,5],[27,2,27,8],[25,0,28,1],[25,2,25,8],[20,2,20,5],[6,0,17,1],[6,2,6,8],[18,2,18,8],[19,2,19,8],[18,0,20,1],[16,2,16,8],[1,14,5,14],[2,0,5,5],[2,13,5,13],[4,11,5,11],[6,14,17,14],[7,2,7,8],[8,2,8,8],[9,2,9,8],[10,2,10,8],[11,2,11,8],[1,0,1,5],[12,2,12,8],[13,2,13,8],[14,2,14,8],[15,2,15,8],[17,2,17,5],[21,2,21,8],[22,2,22,8],[23,2,23,8],[21,0,24,1],[24,2,24,5]]}
["行為前後の土地利用集計表",null,null,null,null,null,null,null,null,null,null,null,null,null,"様式－Ｃ"]
["土地利用区分",null,null,null,null,null,null,null,null,"①欄　様式-１","②欄　様式-２","③欄","④欄","参考","備　　考"]
["土　地　利　用　区　分",null,null,null,null,null,null,null,null,"現況土地利用","計画土地利用","面積差","雨水浸透阻害行為の当該面積","流出係数"]
[null,null,null,null,null,null,null,null,null,"面積（ha）①","面積（ha）②","（ha）"]
[null,null,null,null,null,null,null,null,null,"様式－１","様式－２","②－①","③欄が（＋）の場合、原則該当"]
[null,null,null,null,null,null,null,null,null,"小計１の欄","小計１の欄",null,"該当の場合面積（ha）を記入"]
["宅地等",null,"宅　　　地",null,null,null,null,null,null,{"$f":"'様式－Ａ'!$B$22","v":1},{"$f":"'様式－Ｂ'!$B$22","v":2},{"$f":"K7-J7","v":1},{"$f":"IF(L7<=0,\" \",L7)","v":1},0.9,"宅地等の区分同士の増減は対象としない。"]
[null,null,"池　　　沼",null,null,null,null,null,null,{"$f":"'様式－Ａ'!$C$22","v":0},{"$f":"'様式－Ｂ'!$C$22","v":0},{"$f":"K8-J8","v":0}," ",1]
[null,null,"水　　　路",null,null,null,null,null,null,{"$f":"'様式－Ａ'!$D$22","v":0},{"$f":"'様式－Ｂ'!$D$22","v":0},0," ",1]
[null,null,"た  め　池",null,null,null,null,null,null,{"$f":"'様式－Ａ'!$E$22","v":0},{"$f":"'様式－Ｂ'!$E$22","v":0},0," ",1]
[null,null,"道路（法面を有しないものに限る。）",null,null,null,null,null,null,{"$f":"'様式－Ａ'!$F$22","v":0},{"$f":"'様式－Ｂ'!$F$22","v":0},0," ",0.9]
[null,null,"道路（法面を有するものに限る。）",null,null,null,null,null,null,{"$f":"'様式－Ａ'!$G$22","v":0},{"$f":"'様式－Ｂ'!$G$22","v":0},0," ","加重平均"]
[null,null,"鉄道線路（法面を有しないものに限る。）",null,null,null,null,null,null,{"$f":"'様式－Ａ'!$H$22","v":0},{"$f":"'様式－Ｂ'!$H$22","v":0},0," ",0.9]
[null,null,"鉄道線路（法面を有するものに限る。）",null,null,null,null,null,null,{"$f":"'様式－Ａ'!$I$22","v":0},{"$f":"'様式－Ｂ'!$I$22","v":0},0," ","加重平均"]
[null,null,"飛行場（法面を有しないものに限る。）",null,null,null,null,null,null,{"$f":"'様式－Ａ'!$J$22","v":0},{"$f":"'様式－Ｂ'!$J$22","v":0},0," ",0.9]
[null,null,"飛行場（法面を有するものに限る。）",null,null,null,null,null,null,{"$f":"'様式－Ａ'!$K$22","v":0},{"$f":"'様式－Ｂ'!$K$22","v":0},0,{"$f":"IF(L16<=0,\" \",L16)","v":" "},"加重平均"]
[null,null,"太陽光パネル",null,null,null,null,null,null,{"$f":"'様式－Ａ'!L22","v":0},{"$f":"'様式－Ｂ'!L22","v":0},0," ",0.9]
[null,null,"小　　　計",null,null,null,null,null,null,{"$f":"SUM(J7:J17)","v":1},{"$f":"SUM(K7:K17)","v":2},{"$f":"SUM(L7:L17)","v":1},{"$f":"SUM(M7:M17)","v":1}]
["舗装された土地",null,"コンクリート等の不浸透性の材料により覆われた土地（法面を除く）",null,null,null,null,null,null,{"$f":"'様式－Ａ'!$M$22","v":0},{"$f":"'様式－Ｂ'!$M$22","v":0},{"$f":"K19-J19","v":0}," ",0.95]
[null,null,"コンクリート等の不浸透性の材料により覆われた法面",null,null,null,null,null,null,{"$f":"'様式－Ａ'!$N$22","v":0},{"$f":"'様式－Ｂ'!$N$22","v":0},{"$f":"K20-J20","v":0}," ",1]
[null,null,"小　　　計",null,null,null,null,null,null,{"$f":"SUM(J19:J20)","v":0},{"$f":"SUM(K19:K20)","v":0},{"$f":"SUM(L19:L20)","v":0},{"$f":"SUM(M19:M20)","v":0}]
["その他土地からの流出雨水量を増加させるおそれのある行為に係る土地",null,"ゴルフ場（雨水を排除するための排水施設を伴うもの）",null,null,null,null,null,null,{"$f":"'様式－Ａ'!$O$22","v":0},{"$f":"'様式－Ｂ'!$O$22","v":0},{"$f":"K22-J22","v":0}," ",0.5]
[null,null,"運動場その他これに類する施設（雨水を排除するための排水施設を伴うものに限る。",null,null,null,null,null,null,{"$f":"'様式－Ａ'!$P$22","v":0},{"$f":"'様式－Ｂ'!$P$22","v":0},{"$f":"K23-J23","v":0}," ",0.8]
[null,null,"ローラーその他これに類する建設機械を用いて締め固められた土地",null,null,null,null,null,null,{"$f":"'様式－Ａ'!$Q$22","v":0},{"$f":"'様式－Ｂ'!$Q$22","v":0},{"$f":"K24-J24","v":0},{"$f":"IF(L24<=0,\" \",L24)","v":" "},0.5]
[null,null,"小　　　計",null,null,null,null,null,null,{"$f":"SUM(J22:J24)","v":0},{"$f":"SUM(K22:K24)","v":0},{"$f":"SUM(L22:L24)","v":0},{"$f":"SUM(M22:M24)","v":0}]
["上記に揚げる土地以外の土地",null,"山　　　地",null,null,null,null,null,null,{"$f":"'様式－Ａ'!$R$22","v":0},{"$f":"'様式－Ｂ'!$R$22","v":0},{"$f":"K26-J26","v":0},null,0.3]
[null,null,"人工的に造成された植生に覆われた法面",null,null,null,null,null,null,{"$f":"'様式－Ａ'!$S$22","v":0},{"$f":"'様式－Ｂ'!$S$22","v":0},{"$f":"K27-J27","v":0},null,0.4]
[null,null,"林地、耕地、原野その他ローラーその他これに類する建設機械を用いていない土地",null,null,null,null,null,null,{"$f":"'様式－Ａ'!$T$22","v":1},{"$f":"'様式－Ｂ'!$T$22","v":0},{"$f":"K28-J28","v":-1},null,0.2]
[null,null,"小　　　計",null,null,null,null,null,null,{"$f":"SUM(J26:J28)","v":1},{"$f":"SUM(K26:K28)","v":0},{"$f":"SUM(L26:L28)","v":-1}]
["合　　　計",null,null,null,null,null,null,null,null,{"$f":"J18+J21+J25+J29","v":2},{"$f":"K18+K21+K25+K29","v":2},{"$f":"L18+L21+L25+L29","v":0},{"$f":"M18+M21+M25","v":1}]
[null,null,null,null,null,null,null,null,null,null,null,null,"(－)の欄は記載不要","（単位：ha）"]
["④欄の合計",null,{"$f":"M30","v":1},null,null,null,"ha"]
[null,null,"  0.1ha（1,000㎡）以上の場合、申請の対象"]

{"sheet":"様式－Ｄ","index":8,"n_rows":33,"n_cols":7,"rows_kept":33,"cut":false,"hidden":true,"merged":[[27,0,29,2],[30,0,30,3],[31,0,31,3],[19,0,26,0],[19,1,20,2],[21,1,23,2],[0,6,1,6],[7,0,7,2],[24,1,26,2],[3,3,3,5],[8,0,18,0],[8,1,18,2]]}
[null,null,null,null,null,null,"様式－Ｄ"]
["雨水浸透阻害行為前後の平均流出係数　"]
[]
["行為区域位置",null,null,{"$f":"事前相談書!G8","v":0}]
["行為面積",null,null,{"$f":"'様式－Ｃ'!M30","v":1}]
["行為前後の土地利用区分"]
[]
["区分",null,null,"土地利用の形態の細区分","流出係数","行為前面積\n（ha）","行為後面積\n（ha）"]
["宅地等に該当する土地","第１号関連",null,"宅地",0.9,{"$f":"'様式－Ｃ'!J7","v":1},{"$f":"'様式－Ｃ'!K7","v":2}]
[null,null,null,"池沼",1,{"$f":"'様式－Ｃ'!J8","v":0},{"$f":"'様式－Ｃ'!K8","v":0}]
[null,null,null,"水路",1,{"$f":"'様式－Ｃ'!J9","v":0},{"$f":"'様式－Ｃ'!K9","v":0}]
[null,null,null,"ため池",1,{"$f":"'様式－Ｃ'!J10","v":0},{"$f":"'様式－Ｃ'!K10","v":0}]
[null,null,null,"道路(法面を有しないもの）",0.9,{"$f":"'様式－Ｃ'!J11","v":0},{"$f":"'様式－Ｃ'!K11","v":0}]
[null,null,null,"道路（法面を有するもの）",null,{"$f":"'様式－Ｃ'!J12","v":0},{"$f":"'様式－Ｃ'!K12","v":0}]
[null,null,null,"鉄道線路（法面を有しないもの）",0.9,{"$f":"'様式－Ｃ'!J13","v":0},{"$f":"'様式－Ｃ'!K13","v":0}]
[null,null,null,"鉄道線路（法面を有するもの）",null,{"$f":"'様式－Ｃ'!J14","v":0},{"$f":"'様式－Ｃ'!K14","v":0}]
[null,null,null,"飛行場（法面を有しないもの）",0.9,{"$f":"'様式－Ｃ'!J15","v":0},{"$f":"'様式－Ｃ'!K15","v":0}]
[null,null,null,"飛行場（法面を有するもの）",null,{"$f":"'様式－Ｃ'!J16","v":0},{"$f":"'様式－Ｃ'!K16","v":0}]
[null,null,null,"太陽光パネル",0.9,{"$f":"'様式－Ｃ'!J17","v":0},{"$f":"'様式－Ｃ'!K17","v":0}]
["宅地等以外の土地","第２号\n関　連",null,"不浸透性材料により舗装された土地（法面を除く）",0.95,{"$f":"'様式－Ｃ'!J19","v":0},{"$f":"'様式－Ｃ'!K19","v":0}]
[null,null,null,"不浸透性材料により覆われた法面",1,{"$f":"'様式－Ｃ'!J20","v":0},{"$f":"'様式－Ｃ'!K20","v":0}]
[null,"第３号関連",null,"ゴルフ場（雨水を排除するための排水施設を伴うものに限る）",0.5,{"$f":"'様式－Ｃ'!J22","v":0},{"$f":"'様式－Ｃ'!K22","v":0}]
[null,null,null,"運動場その他これに類する施設（雨水を排除するための排水施設を伴うものに限る）",0.8,{"$f":"'様式－Ｃ'!J23","v":0},{"$f":"'様式－Ｃ'!K23","v":0}]
[null,null,null,"ローラーその他これに類する建設機械を用いて締め固められた土地",0.5,{"$f":"'様式－Ｃ'!J24","v":0},{"$f":"'様式－Ｃ'!K24","v":0}]
[null,"上記第１号から\n第３号に掲げる\n土地以外の土地",null,"山地",0.3,{"$f":"'様式－Ｃ'!J26","v":0},{"$f":"'様式－Ｃ'!K26","v":0}]
[null,null,null,"人工的に造成され植生に覆われた法面",0.4,{"$f":"'様式－Ｃ'!J27","v":0},{"$f":"'様式－Ｃ'!K27","v":0}]
[null,null,null,"林地、耕地、原野その他ローラーその他これに類する建設機械を用いて締め固められていない土地",0.2,{"$f":"'様式－Ｃ'!J28","v":1},{"$f":"'様式－Ｃ'!K28","v":0}]
["その他"]
[]
[]
["面積計",null,null,null,null,{"$f":"SUM(F9:F30)","v":2},{"$f":"SUM(G9:G30)","v":2}]
["平均流出係数",null,null,null,null,{"$f":"ROUND(($E9*F9+$E10*F10+$E11*F11+$E12*F12+$E13*F13+$E14*F14+$E15*F15+$E16*F16+$E17*F17+$E18*F18+$E20*F20+$E21*F21+$E22*F22+$E23*F23+$E24*F24+$E25*F25+$E26*F26+$E27*F27+E19*F19+E28*F28+E29*F29+E30*F30)/F31,3)","v":0.55000000000000004},{"$f":"ROUND(($E9*G9+$E10*G10+$E11*G11+$E12*G12+$E13*G13+$E15*G15+$E17*G17+$E20*G20+$E21*G21+$E22*G22+$E23*G23+$E24*G24+$E25*G25+$E26*G26+$E27*G27+E19*G19+E14*G14+E16*G16+E18*G18+E28*G28+E29*G29+E30*G30)/G31,3)","v":0.9}]
[null,"※　様式－Ａ、－Ｂ、図面－３、－４、－５、－６参照"]

{"sheet":"様式－E","index":9,"n_rows":59,"n_cols":6,"rows_kept":59,"cut":false,"hidden":true,"merged":[[32,1,33,5],[1,1,1,5],[18,1,18,5],[47,1,48,5]]}
[null,null,null,null,null,"様式－E"]
[null,"特定都市河川法第30条に係る対策量の算出"]
[]
[null,null,"開発区域面積",{"$f":"事前相談チェックシート!R4","v":2},"ha"]
[null,null,"行為面積",{"$f":"事前相談チェックシート!R5","v":2},"ha"]
[null,null,"行為前の平均流出係数",{"$f":"'様式－Ｄ'!F32","v":0.55000000000000004}]
[null,null,"行為前のピーク流入量",{"$f":"事前相談チェックシート!R11","v":0.47543999999999997},"m3/s"]
[null,null,"行為後の平均流出係数",{"$f":"'様式－Ｄ'!G32","v":0.9}]
[null,null,"行為後のピーク流入量",{"$f":"事前相談チェックシート!R13","v":0.77800000000000002},"m3/s"]
[null,"a","haあたり放流量",{"$f":"'様式－E'!#REF!/'様式－E'!D4","v":{"$error":"#REF!"}},"m3/s/ha"]
[null,null,"調整池の水深",{"$f":"事前相談チェックシート!R9","v":1},"ｍ"]
[null,null,"調整池の容量（haあたり）",{"$f":"事前相談チェックシート!R15","v":270},"m3/ha"]
[]
[null,"①","必要対策量",{"$f":"事前相談チェックシート!R16","v":540},"m3"]
[null,"③","許容放流量",{"$f":"IF(D14=\"不要\",\"不要\",D7)","v":0.47543999999999997},"m3/s"]
[null,"⑤","オリフィス径",{"$f":"IF(D14=\"不要\",\"不要\",事前相談チェックシート!R14)","v":0.47699999999999998},"m"]
[]
[]
[null,"都市計画法に基づく開発指導等としての\n必要対策量(開発区域面積1ha未満)"]
[]
[null,null,"開発区域面積",{"$f":"事前相談チェックシート!R4","v":2},"ha"]
[null,null,"行為面積",{"$f":"事前相談チェックシート!R6","v":1},"ha"]
[null,null,"対策基準",{"$f":"事前相談チェックシート!V7","v":0},"m3/ha"]
[null,null,"許容比流量",{"$f":"事前相談チェックシート!V9","v":0},"m3/s/ha"]
[null,null,"許容放流量",{"$f":"D24*D22","v":0},"m3/s"]
[null,"b","許容放流量",{"$f":"事前相談チェックシート!V10","v":0},"m3/s/ha"]
[]
[null,"②","必要対策量",{"$f":"事前相談チェックシート!V12","v":"不要"},"m3"]
[null,"④","許容放流量",{"$f":"IF(D28=\"不要\",\"不要\",D24*D22)","v":"不要"},"m3/s"]
[null,"⑥","オリフィス径",{"$f":"IF(D28=\"不要\",\"不要\",事前相談チェックシート!V11)","v":"不要"},"m"]
[]
[]
[null,"都市計画法に基づく開発指導等としての必要対策量（開発区域面積1ha以上）\n【埼玉県雨水流出抑制施設の設置等に関する条例】"]
[]
[]
[null,null,"開発区域面積",{"$f":"事前相談チェックシート!R4","v":2},"ha"]
[null,null,"行為面積",{"$f":"事前相談チェックシート!R6","v":1},"ha"]
[null,null,"対策基準（地域別調整容量）",{"$f":"事前相談チェックシート!V16","v":700},"m3/ha"]
[null,null,"湛水区域対策量",{"$f":"事前相談チェックシート!V18","v":0},"m3"]
[null,"b","許容放流量",{"$f":"事前相談チェックシート!V18","v":0},"m3/s/ha"]
[null,null,"許容比流量",{"$f":"事前相談チェックシート!V19","v":0.05},"m3/s/ha"]
[null,null,"許容放流量",{"$f":"D41*D37","v":0.05},"m3/s"]
[]
[null,"②","必要対策量(条例)",{"$f":"事前相談チェックシート!V22","v":700},"m3"]
[null,"④","許容放流量",{"$f":"IF(D44=\"不要\",\"不要\",D41*D37)","v":0.05},"m3/s"]
[null,"⑥","オリフィス径",{"$f":"IF(D44=\"不要\",\"不要\",事前相談チェックシート!V21)","v":0.219},"m"]
[]
[null,"※都市計画法の開発許可等との調整により双方の機能を兼ね備えた対策工事とする\n　（流出抑制量が大きい方で対策）"]
[]
[null,"〇許可対策量"]
[null,null,"①もしくは②の大きい方",{"$f":"事前相談チェックシート!S25","v":700},"m3"]
[null,"〇許容放流量"]
[null,null,"③もしくは④の小さい方",{"$f":"事前相談チェックシート!U25","v":0.1},"m3/s"]
[null,"〇許容放流量に対応したオリフィス径"]
[null,null,"⑤もしくは⑥の小さい方",{"$f":"MIN(D16,D30,D46)","v":0.219},"m"]
[]
[]
[null,"〇許容放流量"]
[null,null,"aもしくはbの小さい方",{"$f":"事前相談チェックシート!#REF!","v":{"$error":"#REF!"}},"m3/s/ha"]

{"sheet":"コントロールシート（貯留＋浸透）","index":10,"n_rows":25,"n_cols":13,"rows_kept":25,"cut":false,"hidden":false,"merged":[[24,2,26,3],[20,2,20,3],[19,2,19,3],[21,2,21,3],[14,2,14,3],[15,2,15,3],[12,5,12,7],[14,9,14,10],[24,5,26,7],[24,9,26,12],[16,5,19,7],[1,9,1,12],[2,9,2,12],[16,2,16,3],[17,2,17,3],[18,2,18,3],[2,5,2,6],[7,5,7,7],[13,5,13,7],[3,2,3,3],[2,2,2,3],[4,2,4,3],[4,5,4,7],[17,9,17,10],[16,9,16,10],[15,9,15,10],[5,5,6,7],[0,2,0,3],[0,9,0,12],[0,5,0,7],[13,9,13,12],[5,9,6,12],[8,9,8,10],[11,9,11,12],[10,9,10,10],[12,2,12,3],[5,2,6,3],[13,2,13,3],[3,9,3,12],[4,9,4,12],[12,9,12,12],[1,2,1,3],[1,5,1,7]]}
[null,null,"浸透施設の計算",null,null,"浸透施設を見込んだ貯留容量",null,null,null,"オリフィス(1段)による自然調節計算"]
[null,null,"事前に入力しておくシート",null,null,"事前に入力しておくシート",null,null,null,"事前に入力しておくシート"]
[null,null,"施設諸元（浸透）",null,null,"施設諸元（浸透）",null,null,null,"施設諸元(自然調節)"]
[null,null,"施設諸元（浸透_道路管理者用）",null,null,"施設諸元（浸透_道路管理者用）"]
[null,null,"その他、事前相談チェックシートに必要な項目",null,null,"その他、事前相談チェックシートに必要な項目"]
[null,null,"浸透施設に該当する項目にチェックを入れてください",null,null,"事前相談チェックシートで計算した必要対策量",null,null,null,"調整池諸元を記入する際の参考値"]
[]
[null,null,2,"浸透施設なし",null,"必要対策量（貯留量換算）",null,null,null,"浸透を考慮した必要な貯留施設容量",null,{"$f":"G15","v":700},"m3"]
[null,null,null,"浸透施設あり\n※施設諸元(浸透)に入力した場合",null,"法",{"$f":"事前相談チェックシート!R16","v":540},"m3",null,"調整池の最大水深\n※オリフィス底部から設計水位\nまでの水深",null,{"$f":"事前相談チェックシート!R9","v":1},"m"]
[null,null,null,"浸透施設あり\n※施設諸元（浸透_道路管理者用）に入力した場合",null,"総合治水対策で\n必要な対策量(1.0ha以上)",{"$f":"事前相談チェックシート!V22","v":700},"m3",null,"オリフィス径",null,{"$f":"事前相談チェックシート!V25","v":0.219},"m"]
[null,null,null,null,null,"総合治水対策で\n必要な対策量(1.0ha未満)",{"$f":"事前相談チェックシート!V12","v":"不要"},"m3",null,"　　(オリフィス断面積)",null,{"$f":"PI()*(L10/2)^2","v":3.7668481314705016E-2},"m2"]
[null,null,null,null,null,null,{"$f":"IF(MAX(G9:G11)=G9,1,IF(MAX(G9:G11)=G10,2,3))","v":2},null,null,"※上記数値は事前相談チェックシート記載の数値です"]
[null,null,"計算結果",null,null,"計算結果",null,null,null,"計算結果"]
[null,null,"上のチェックを入れ、「浸透施設の計算」ボタンを押してください",null,null,"上記、事前相談チェックシートで計算した必要対策量を確認の上「浸透施設を見込んだ貯留容量の算定」ボタンを押してください",null,null,null,"上記シートの入力が完了したら「自然調節計算」ボタンを\n押してください"]
[null,null,"Q1:許容放流量(m3/s)",null,null,"必要貯留施設容量",700,"m3",null,"設定したオリフィス断面積",null,{"$f":"IF('施設諸元（自然調節）'!D7=\"円形\",PI()*('施設諸元（自然調節）'!D8/2)^2,'施設諸元（自然調節）'!D9*'施設諸元（自然調節）'!D10)","v":3.7668481314705016E-2},"m2"]
[null,null,{"$f":"事前相談チェックシート!U25","v":0.1},null,null,null,null,null,null,"設定した貯留施設容量",null,{"$f":"MAX('施設諸元（自然調節）'!C14:C63)","v":700},"m3"]
[null,null,"Q2:行為後ピーク流入量（浸透考慮前）(m3/s)",null,null,"施設諸元(浸透)又は\n施設諸元(浸透_道路管理者用)に\n入力した浸透施設と\n上記貯留施設が必要となります。",null,null,null,"許容放流量",null,{"$f":"事前相談チェックシート!U25","v":0.1},"m3/s"]
[null,null,{"$f":"浸透計算!B2","v":0.77800000000000002},null,null,null,null,null,null,"ピーク時のオリフィス放流量（計算値）",null,{"$f":"'調節計算（自然調節方式）'!E2","v":9.4422253028602465E-2},"m3/s"]
[null,null,"Q3:行為後ピーク流入量（浸透考慮後）(m3/s)"]
[null,null,{"$f":"浸透計算!C2","v":0.77800000000000002},null,null,null,null,null,null,"貯留量の判定",null,{"$f":"IF(L16>=L8,\"O.K.\",\"N.G.\")","v":"O.K."}]
[null,null,"Q3≦Q1の場合、浸透施設のみで処理可能",null,null,null,null,null,null,"ピーク放流量の判定",null,{"$f":"IF(L18<=L17,\"O.K.\",\"N.G\")","v":"O.K."}]
[]
[]
[]
[null,null,"※浸透施設を見込まない場合も、「浸透施設なし」にチェックの上、「浸透施設の計算」を実施してください",null,null,"※「①浸透施設の計算」実施後に押してください",null,null,null,"※貯留量の判定が「N.G.」となった場合には貯留施設を大きく、ピーク放流量の判定は「N.G」となった場合には放流口径を小さくしてください\n※浸透施設の見直しを行った場合は「①浸透施設の計算」からやり直してください（見直しを行わなかった場合には不要です）"]

{"sheet":"様式－Ｆ－①","index":11,"n_rows":32,"n_cols":10,"rows_kept":32,"cut":false,"hidden":true,"merged":[[27,1,29,3],[30,1,30,4],[31,1,31,4],[3,4,3,6],[7,1,7,3],[8,1,18,1],[8,2,18,3],[19,1,26,1],[19,2,20,3],[21,2,23,3],[24,2,26,3]]}
[]
["１．行為区域の概要　",null,null,null,null,null,null,"様式－F－①"]
[null,"（※位置及び行為前後の土地利用区分のわかる平面図を添付すること）"]
["行為区域位置",null,null,null,{"$f":"許可申請書!G19","v":0}]
["行為面積",null,null,null,{"$f":"事前相談チェックシート!M28","v":2}]
["行為前後の土地利用区分"]
[]
[null,"区分",null,null,"土地利用の形態の細区分","流出係数","行為前面積\n（ha）","行為後面積\n（ha）"]
[null,"宅地等に該当する土地","第１号関連",null,"宅地",{"$f":"'様式－Ｄ'!E9","v":0.9},{"$f":"'様式－Ｄ'!F9","v":1},{"$f":"'様式－Ｄ'!G9","v":2}]
[null,null,null,null,"池沼",{"$f":"'様式－Ｄ'!E10","v":1},{"$f":"'様式－Ｄ'!F10","v":0},{"$f":"'様式－Ｄ'!G10","v":0}]
[null,null,null,null,"水路",{"$f":"'様式－Ｄ'!E11","v":1},{"$f":"'様式－Ｄ'!F11","v":0},{"$f":"'様式－Ｄ'!G11","v":0}]
[null,null,null,null,"ため池",{"$f":"'様式－Ｄ'!E12","v":1},{"$f":"'様式－Ｄ'!F12","v":0},{"$f":"'様式－Ｄ'!G12","v":0}]
[null,null,null,null,"道路(法面を有しないもの）",{"$f":"'様式－Ｄ'!E13","v":0.9},{"$f":"'様式－Ｄ'!F13","v":0},{"$f":"'様式－Ｄ'!G13","v":0}]
[null,null,null,null,"道路（法面を有するもの）",{"$f":"'様式－Ｄ'!E14","v":0},{"$f":"'様式－Ｄ'!F14","v":0},{"$f":"'様式－Ｄ'!G14","v":0}]
[null,null,null,null,"鉄道線路（法面を有しないもの）",{"$f":"'様式－Ｄ'!E15","v":0.9},{"$f":"'様式－Ｄ'!F15","v":0},{"$f":"'様式－Ｄ'!G15","v":0}]
[null,null,null,null,"鉄道線路（法面を有するもの）",{"$f":"'様式－Ｄ'!E16","v":0},{"$f":"'様式－Ｄ'!F16","v":0},{"$f":"'様式－Ｄ'!G16","v":0}]
[null,null,null,null,"飛行場（法面を有しないもの）",{"$f":"'様式－Ｄ'!E17","v":0.9},{"$f":"'様式－Ｄ'!F17","v":0},{"$f":"'様式－Ｄ'!G17","v":0}]
[null,null,null,null,"飛行場（法面を有するもの）",{"$f":"'様式－Ｄ'!E18","v":0},{"$f":"'様式－Ｄ'!F18","v":0},{"$f":"'様式－Ｄ'!G18","v":0}]
[null,null,null,null,"太陽光パネル",{"$f":"'様式－Ｄ'!E19","v":0.9},{"$f":"'様式－Ｄ'!F19","v":0},{"$f":"'様式－Ｄ'!G19","v":0},{"$f":"$F19*$G19","v":0},{"$f":"$F19*$H19","v":0}]
[null,"宅地等以外の土地","第２号\n関　連",null,"不浸透性材料により舗装された土地\n（法面を除く）",{"$f":"'様式－Ｄ'!E20","v":0.95},{"$f":"'様式－Ｄ'!F20","v":0},{"$f":"'様式－Ｄ'!G20","v":0}]
[null,null,null,null,"不浸透性材料により覆われた法面",{"$f":"'様式－Ｄ'!E21","v":1},{"$f":"'様式－Ｄ'!F21","v":0},{"$f":"'様式－Ｄ'!G21","v":0}]
[null,null,"第３号関連",null,"ゴルフ場（雨水を排除するための排水施設を伴うものに限る）",{"$f":"'様式－Ｄ'!E22","v":0.5},{"$f":"'様式－Ｄ'!F22","v":0},{"$f":"'様式－Ｄ'!G22","v":0}]
[null,null,null,null,"運動場その他これに類する施設（雨水を排除するための排水施設を伴うものに限る）",{"$f":"'様式－Ｄ'!E23","v":0.8},{"$f":"'様式－Ｄ'!F23","v":0},{"$f":"'様式－Ｄ'!G23","v":0}]
[null,null,null,null,"ローラーその他これに類する建設機械を用いて締め固められた土地",{"$f":"'様式－Ｄ'!E24","v":0.5},{"$f":"'様式－Ｄ'!F24","v":0},{"$f":"'様式－Ｄ'!G24","v":0}]
[null,null,"上記第１号から\n第３号に掲げる\n土地以外の土地",null,"山地",{"$f":"'様式－Ｄ'!E25","v":0.3},{"$f":"'様式－Ｄ'!F25","v":0},{"$f":"'様式－Ｄ'!G25","v":0}]
[null,null,null,null,"人工的に造成され植生に覆われた法面",{"$f":"'様式－Ｄ'!E26","v":0.4},{"$f":"'様式－Ｄ'!F26","v":0},{"$f":"'様式－Ｄ'!G26","v":0}]
[null,null,null,null,"林地、耕地、原野その他ローラーその他これに類する建設機械を用いて締め固められていない土地",{"$f":"'様式－Ｄ'!E27","v":0.2},{"$f":"'様式－Ｄ'!F27","v":1},{"$f":"'様式－Ｄ'!G27","v":0}]
[null,"そ　の　他",null,null,null,{"$f":"'様式－Ｄ'!E28","v":0},{"$f":"'様式－Ｄ'!F28","v":0},{"$f":"'様式－Ｄ'!G28","v":0}]
[null,null,null,null,null,{"$f":"'様式－Ｄ'!E29","v":0},{"$f":"'様式－Ｄ'!F29","v":0},{"$f":"'様式－Ｄ'!G29","v":0}]
[null,null,null,null,null,{"$f":"'様式－Ｄ'!E30","v":0},{"$f":"'様式－Ｄ'!F30","v":0},{"$f":"'様式－Ｄ'!G30","v":0}]
[null,"面積計",null,null,null,null,{"$f":"SUM(G9:G30)","v":2},{"$f":"SUM(H9:H30)","v":2}]
[null,"平均流出係数",null,null,null,null,{"$f":"SUMPRODUCT($F$9:$F$30,G9:G30)/$G$31","v":0.55000000000000004},{"$f":"SUMPRODUCT($F$9:$F$30,H9:H30)/$H$31","v":0.9}]

{"sheet":"ピーク流量算定表","index":12,"n_rows":46,"n_cols":13,"rows_kept":46,"cut":false,"hidden":false,"merged":[[3,4,3,5],[4,4,4,5],[5,11,6,12]]}
[]
["使用降雨強度及び行為前後のピーク流入量"]
[]
["ピーク流入量（行為前）",null,null,null,{"$f":"事前相談チェックシート!R11","v":0.47543999999999997},null,"m3／s"]
["ピーク流入量（行為後）",null,null,null,{"$f":"事前相談チェックシート!R13","v":0.77800000000000002},null,"m3／s"]
[null,null,null,null,null,null,null,null,null,null,null,{"$f":"事前相談チェックシート!U4","v":"埼玉県南部"}]
[]
["降雨強度の推移表"]
[]
[null,"時","分","降雨量\n（mm/h）","時","分","降雨量\n（mm/h）","時","分","降雨量\n（mm/h）","時","分","降雨量\n（mm/h）"]
[null,0,"0－10",{"$f":"mkrain!G4","v":4.0999999999999996},6,"0－10",{"$f":"mkrain!G40","v":6.6},12,"0－10",{"$f":"mkrain!G76","v":87},18,"0－10",{"$f":"mkrain!G112","v":6.5}]
[null,null,"10－20",{"$f":"mkrain!G5","v":4.0999999999999996},null,"10－20",{"$f":"mkrain!G41","v":6.8},null,"10－20",{"$f":"mkrain!G77","v":52.3},null,"10－20",{"$f":"mkrain!G113","v":6.3}]
[null,null,"20－30",{"$f":"mkrain!G6","v":4.2},null,"20－30",{"$f":"mkrain!G42","v":6.9},null,"20－30",{"$f":"mkrain!G78","v":38.9},null,"20－30",{"$f":"mkrain!G114","v":6.2}]
[null,null,"30－40",{"$f":"mkrain!G7","v":4.2},null,"30－40",{"$f":"mkrain!G43","v":7.1},null,"30－40",{"$f":"mkrain!G79","v":31.6},null,"30－40",{"$f":"mkrain!G115","v":6.1}]
[null,null,"40－50",{"$f":"mkrain!G8","v":4.3},null,"40－50",{"$f":"mkrain!G44","v":7.2},null,"40－50",{"$f":"mkrain!G80","v":26.9},null,"40－50",{"$f":"mkrain!G116","v":6}]
[null,null,"50－60",{"$f":"mkrain!G9","v":4.3},null,"50－60",{"$f":"mkrain!G45","v":7.4},null,"50－60",{"$f":"mkrain!G81","v":23.6},null,"50－60",{"$f":"mkrain!G117","v":5.9}]
[null,1,"0－10",{"$f":"mkrain!G10","v":4.3},7,"0－10",{"$f":"mkrain!G46","v":7.6},13,"0－10",{"$f":"mkrain!G82","v":21.1},19,"0－10",{"$f":"mkrain!G118","v":5.8}]
[null,null,"10－20",{"$f":"mkrain!G11","v":4.4000000000000004},null,"10－20",{"$f":"mkrain!G47","v":7.7},null,"10－20",{"$f":"mkrain!G83","v":19.100000000000001},null,"10－20",{"$f":"mkrain!G119","v":5.7}]
[null,null,"20－30",{"$f":"mkrain!G12","v":4.4000000000000004},null,"20－30",{"$f":"mkrain!G48","v":7.9},null,"20－30",{"$f":"mkrain!G84","v":17.600000000000001},null,"20－30",{"$f":"mkrain!G120","v":5.6}]
[null,null,"30－40",{"$f":"mkrain!G13","v":4.5},null,"30－40",{"$f":"mkrain!G49","v":8.1999999999999993},null,"30－40",{"$f":"mkrain!G85","v":16.3},null,"30－40",{"$f":"mkrain!G121","v":5.5}]
[null,null,"40－50",{"$f":"mkrain!G14","v":4.5},null,"40－50",{"$f":"mkrain!G50","v":8.4},null,"40－50",{"$f":"mkrain!G86","v":15.2},null,"40－50",{"$f":"mkrain!G122","v":5.5}]
[null,null,"50－60",{"$f":"mkrain!G15","v":4.5999999999999996},null,"50－60",{"$f":"mkrain!G51","v":8.6},null,"50－60",{"$f":"mkrain!G87","v":14.3},null,"50－60",{"$f":"mkrain!G123","v":5.4}]
[null,2,"0－10",{"$f":"mkrain!G16","v":4.5999999999999996},8,"0－10",{"$f":"mkrain!G52","v":8.9},14,"0－10",{"$f":"mkrain!G88","v":13.5},20,"0－10",{"$f":"mkrain!G124","v":5.3}]
[null,null,"10－20",{"$f":"mkrain!G17","v":4.7},null,"10－20",{"$f":"mkrain!G53","v":9.1},null,"10－20",{"$f":"mkrain!G89","v":12.8},null,"10－20",{"$f":"mkrain!G125","v":5.2}]
[null,null,"20－30",{"$f":"mkrain!G18","v":4.8},null,"20－30",{"$f":"mkrain!G54","v":9.4},null,"20－30",{"$f":"mkrain!G90","v":12.2},null,"20－30",{"$f":"mkrain!G126","v":5.2}]
[null,null,"30－40",{"$f":"mkrain!G19","v":4.8},null,"30－40",{"$f":"mkrain!G55","v":9.8000000000000007},null,"30－40",{"$f":"mkrain!G91","v":11.6},null,"30－40",{"$f":"mkrain!G127","v":5.0999999999999996}]
[null,null,"40－50",{"$f":"mkrain!G20","v":4.9000000000000004},null,"40－50",{"$f":"mkrain!G56","v":10.1},null,"40－50",{"$f":"mkrain!G92","v":11.2},null,"40－50",{"$f":"mkrain!G128","v":5}]
[null,null,"50－60",{"$f":"mkrain!G21","v":4.9000000000000004},null,"50－60",{"$f":"mkrain!G57","v":10.5},null,"50－60",{"$f":"mkrain!G93","v":10.7},null,"50－60",{"$f":"mkrain!G129","v":5}]
[null,3,"0－10",{"$f":"mkrain!G22","v":5},9,"0－10",{"$f":"mkrain!G58","v":10.9},15,"0－10",{"$f":"mkrain!G94","v":10.3},21,"0－10",{"$f":"mkrain!G130","v":4.9000000000000004}]
[null,null,"10－20",{"$f":"mkrain!G23","v":5.0999999999999996},null,"10－20",{"$f":"mkrain!G59","v":11.4},null,"10－20",{"$f":"mkrain!G95","v":9.9},null,"10－20",{"$f":"mkrain!G131","v":4.8}]
[null,null,"20－30",{"$f":"mkrain!G24","v":5.0999999999999996},null,"20－30",{"$f":"mkrain!G60","v":11.9},null,"20－30",{"$f":"mkrain!G96","v":9.6},null,"20－30",{"$f":"mkrain!G132","v":4.8}]
[null,null,"30－40",{"$f":"mkrain!G25","v":5.2},null,"30－40",{"$f":"mkrain!G61","v":12.5},null,"30－40",{"$f":"mkrain!G97","v":9.3000000000000007},null,"30－40",{"$f":"mkrain!G133","v":4.7}]
[null,null,"40－50",{"$f":"mkrain!G26","v":5.3},null,"40－50",{"$f":"mkrain!G62","v":13.1},null,"40－50",{"$f":"mkrain!G98","v":9},null,"40－50",{"$f":"mkrain!G134","v":4.7}]
[null,null,"50－60",{"$f":"mkrain!G27","v":5.3},null,"50－60",{"$f":"mkrain!G63","v":13.9},null,"50－60",{"$f":"mkrain!G99","v":8.6999999999999993},null,"50－60",{"$f":"mkrain!G135","v":4.5999999999999996}]
[null,4,"0－10",{"$f":"mkrain!G28","v":5.4},10,"0－10",{"$f":"mkrain!G64","v":14.7},16,"0－10",{"$f":"mkrain!G100","v":8.5},22,"0－10",{"$f":"mkrain!G136","v":4.5999999999999996}]
[null,null,"10－20",{"$f":"mkrain!G29","v":5.5},null,"10－20",{"$f":"mkrain!G65","v":15.7},null,"10－20",{"$f":"mkrain!G101","v":8.3000000000000007},null,"10－20",{"$f":"mkrain!G137","v":4.5}]
[null,null,"20－30",{"$f":"mkrain!G30","v":5.6},null,"20－30",{"$f":"mkrain!G66","v":16.899999999999999},null,"20－30",{"$f":"mkrain!G102","v":8},null,"20－30",{"$f":"mkrain!G138","v":4.5}]
[null,null,"30－40",{"$f":"mkrain!G31","v":5.7},null,"30－40",{"$f":"mkrain!G67","v":18.3},null,"30－40",{"$f":"mkrain!G103","v":7.8},null,"30－40",{"$f":"mkrain!G139","v":4.4000000000000004}]
[null,null,"40－50",{"$f":"mkrain!G32","v":5.8},null,"40－50",{"$f":"mkrain!G68","v":20},null,"40－50",{"$f":"mkrain!G104","v":7.7},null,"40－50",{"$f":"mkrain!G140","v":4.4000000000000004}]
[null,null,"50－60",{"$f":"mkrain!G33","v":5.9},null,"50－60",{"$f":"mkrain!G69","v":22.2},null,"50－60",{"$f":"mkrain!G105","v":7.5},null,"50－60",{"$f":"mkrain!G141","v":4.3}]
[null,5,"0－10",{"$f":"mkrain!G34","v":6},11,"0－10",{"$f":"mkrain!G70","v":25.1},17,"0－10",{"$f":"mkrain!G106","v":7.3},23,"0－10",{"$f":"mkrain!G142","v":4.3}]
[null,null,"10－20",{"$f":"mkrain!G35","v":6.1},null,"10－20",{"$f":"mkrain!G71","v":29},null,"10－20",{"$f":"mkrain!G107","v":7.1},null,"10－20",{"$f":"mkrain!G143","v":4.2}]
[null,null,"20－30",{"$f":"mkrain!G36","v":6.2},null,"20－30",{"$f":"mkrain!G72","v":34.799999999999997},null,"20－30",{"$f":"mkrain!G108","v":7},null,"20－30",{"$f":"mkrain!G144","v":4.2}]
[null,null,"30－40",{"$f":"mkrain!G37","v":6.3},null,"30－40",{"$f":"mkrain!G73","v":44.5},null,"30－40",{"$f":"mkrain!G109","v":6.8},null,"30－40",{"$f":"mkrain!G145","v":4.0999999999999996}]
[null,null,"40－50",{"$f":"mkrain!G38","v":6.4},null,"40－50",{"$f":"mkrain!G74","v":64.5},null,"40－50",{"$f":"mkrain!G110","v":6.7},null,"40－50",{"$f":"mkrain!G146","v":4.0999999999999996}]
[null,null,"50－60",{"$f":"mkrain!G39","v":6.5},null,"50－60",{"$f":"mkrain!G75","v":155.6},null,"50－60",{"$f":"mkrain!G111","v":6.6},null,"50－60",{"$f":"mkrain!G147","v":4.0999999999999996}]

{"sheet":"施設諸元（自然調節）","index":13,"n_rows":15,"n_cols":10,"rows_kept":15,"cut":false,"hidden":false,"merged":[[5,1,5,2],[6,1,9,1],[10,1,10,2]]}
[null,null,null,null,"【提出様式】"]
["流出抑制施設諸元(自然調節)"]
[null,"　（※流出抑制施設の配置位置（平面図）、構造諸元のわかる図面を添付すること）"]
[null,"調整池諸元"]
[null,"放流口径（2段オリフィスの場合は、上・下段の諸元を記載）"]
[null,null,null,"下段","上段（２段オリフィスの場合）",null,null,null,null,"円形"]
[null,"放流口形状","形状","円形",null,null,null,null,null,"矩形"]
[null,null,"直径(m)",0.219]
[null,null,"高さ(m)"]
[null,null,"幅(m)"]
[null,"管底位置（池底から）(m)",null,0]
[]
[null,"Ｈ(m)","Ｖ(m3)"]
[null,0,0]
[null,1,700]

{"sheet":"比浸透量","index":14,"n_rows":35,"n_cols":31,"rows_kept":35,"cut":false,"hidden":false,"merged":[[1,0,1,3],[1,10,1,11],[29,1,29,2],[30,1,30,2],[31,1,33,1],[24,10,24,11],[24,1,24,2],[24,5,24,6],[24,7,24,8],[26,1,26,2],[27,1,27,2],[28,1,28,2]]}
[8,null,null,null,null,null,null,null,null,null,null,null,null,null,null,null,null,null,null,null,null,null,null,null,null,null,null,null,null,null,1]
["比浸透量計算書",null,null,null,null,null,null,null,null,null,"【提出様式】"]
[null,null,null,null,null,null,null,null,null,null,null,null,null,null,"大型貯留槽"]
[null,null,"透水性舗装",null,null,null,null,null,null,null,null,null,null,null,"側面及び底面"]
[null,null,"浸透側溝および浸透トレンチ",null,null,null,null,null,null,null,null,null,null,null,"W","H","L","a1","a2","b","X","a","b","K"]
[null,null,"円筒ます（側面および底面）",null,null,null,null,null,null,null,null,null,null,1,5,{"$f":"D$14","v":0.5},{"$f":"D$17","v":30},8.83,-0.46100000000000002,7.03,{"$f":"D$17/D$15","v":60},{"$f":"R6*U6^S6","v":1.3373127251853201},{"$f":"T6","v":7.03},{"$f":"(V6*P6+W6)*Q6","v":230.95969087777982}]
[null,null,"円筒ます（底面）",null,null,null,null,null,null,null,null,null,null,2,10,{"$f":"D$14","v":0.5},{"$f":"D$17","v":30},7.88,-0.44600000000000001,14,{"$f":"D$17/D$15","v":60},{"$f":"R7*U7^S7","v":1.2690267005313376},{"$f":"T7","v":14},{"$f":"(V7*P7+W7)*Q7","v":439.03540050797005}]
[null,null,"正方形ます（側面および底面）",null,null,null,null,null,null,null,null,null,null,3,20,0.5,30,7.06,-0.45200000000000001,27.06,60,1.1093800096150195,27.06,828.44070014422516]
[null,null,"正方形ます（底面）",null,null,null,null,null,null,null,null,null,null,4,30,0.5,30,6.43,-0.44400000000000001,39.75,60,1.0440272102962087,39.75,1208.1604081544431]
[null,null,"矩形の桝",null,null,null,null,null,null,null,null,null,null,5,40,0.5,30,5.97,-0.44,52.25,60,0.98534378344875784,52.25,1582.2801567517313]
[null,null,"大型貯留浸透槽（側面及び底面）",null,null,null,null,null,null,null,null,null,null,6,50,0.5,30,5.62,-0.442,64.680000000000007,60,0.92001193831254136,64.680000000000007,1954.2001790746883]
[null,null,"大型貯留浸透槽（底面）",null,null,null,null,null,null,null,null,null,null,7,{"$f":"D15","v":0.5},{"$f":"D$14","v":0.5},{"$f":"D$17","v":30},{"$f":"R11","v":5.62},{"$f":"S11","v":-0.442},{"$f":"T11","v":64.680000000000007},{"$f":"D$17/D$15","v":60},{"$f":"R12*U12^S12","v":0.92001193831254136},64.680000000000007,{"$f":"(V12*P12+W12)*Q12","v":1954.2001790746883}]
[null,null,null,null,null,null,null,null,null,null,null,null,null,null,"上ランク","下ランク"]
[null,null,"H：設計水頭(m)",0.5,null,null,null,null,null,null,null,null,null,null,{"$f":"IF(D15<=O6,1,IF(D15<=O7,2,IF(D15<=O8,3,IF(D15<=O9,4,IF(D15<=O10,5,IF(D15<=O11,6,7))))))","v":1},{"$f":"IF(D15>=O11,7,IF(O14=1,1,O14-1))","v":1},null,"内挿パラ↓"]
[null,null,"W：施設幅(m)",0.5,null,null,null,null,null,null,null,null,null,"W",{"$f":"VLOOKUP(O14,$N$6:$O$12,2,FALSE)","v":5},{"$f":"VLOOKUP(P14,$N$6:$O$12,2,FALSE)","v":5},{"$f":"D15","v":0.5},{"$f":"IF(O14=P14,0,(Q15-P15)/(O15-P15))","v":0}]
[null,null,"D：施設直径(m)",5,null,null,null,null,null,null,null,null,null,"K",{"$f":"VLOOKUP(O14,$N$6:$X$12,11,FALSE)","v":230.95969087777982},{"$f":"VLOOKUP(P14,$N$6:$X$12,11,FALSE)","v":230.95969087777982},{"$f":"(O16-P16)*R15+P16","v":230.95969087777982}]
[null,null,"L：施設延長(m)",30]
[]
[null,null,"K：比浸透量","適用外"]
[null,null,null,null,null,null,null,null,null,null,null,null,null,null,"大型貯留槽"]
[null,null,null,null,null,null,null,null,null,null,null,null,null,null,"底面"]
[null,null,null,null,null,null,null,null,null,null,null,null,null,null,"W","H","L","a1","a2","b","X","a","b","K"]
[null,null,null,null,null,null,null,null,null,null,null,null,null,1,5,{"$f":"D$14","v":0.5},{"$f":"D$17","v":30},1.94,-0.32800000000000001,7.57,{"$f":"D$17/D$15","v":60},{"$f":"R23*U23^S23","v":0.5064867865799888},{"$f":"T23","v":7.57},{"$f":"(V23*P23+W23)*Q23","v":234.69730179869984}]
[null,null,null,null,null,null,null,null,null,null,null,null,null,2,10,{"$f":"D$14","v":0.5},{"$f":"D$17","v":30},2.29,-0.39700000000000002,13.84,{"$f":"D$17/D$15","v":60},{"$f":"R24*U24^S24","v":0.4507227048771153},{"$f":"T24","v":13.84},{"$f":"(V24*P24+W24)*Q24","v":421.9608405731567}]
[null,"施設",null,"透水性舗装\n（浸透池）","浸透側溝\nおよび\n浸透トレンチ","円筒ます",null,"正方形ます",null,"矩形\nのます","大型貯留槽",null,null,3,20,0.5,30,2.37,-0.48799999999999999,26.36,60,0.32137385017974901,26.36,795.62060775269617]
[null,"浸透面",null,"底面","側面\nおよび\n底面","側面\nおよび\n底面","底面","側面\nおよび\n底面","底面","側面\nおよび\n底面","側面\n及び\n底面","底面",null,4,30,0.5,30,2.17,-0.51800000000000002,38.79,60,0.26024199894712419,38.79,1167.6036299842069]
[null,"模式図",null,null,null,null,null,null,null,null,null,null,null,5,40,0.5,30,1.96,-0.55400000000000005,51.16,60,0.20284311845097919,51.16,1537.8426467767647]
[null,"H：設計水頭（m）",1,{"$f":"$D14","v":0.5},{"$f":"$D14","v":0.5},{"$f":"$D14","v":0.5},{"$f":"$D14","v":0.5},{"$f":"$D14","v":0.5},0.5,0.5,0.5,0.5,null,6,50,0.5,30,1.76,-0.60899999999999999,63.5,60,0.14541813026230432,63.5,1907.1812719539346]
[null,"W：施設幅(m)",null,{"$f":"$D15","v":0.5},{"$f":"$D15","v":0.5},{"$f":"$D15","v":0.5},0.5,0.5,0.5,0.5,0.5,0.5,null,7,{"$f":"D15","v":0.5},0.5,30,{"$f":"R28","v":1.76},{"$f":"S28","v":-0.60899999999999999},{"$f":"T28","v":63.5},60,0.14541813026230432,63.5,1907.1812719539346]
[null,"D：施設直径",null,{"$f":"$D16","v":5},5,5,5,5,5,5,5,5,null,null,"上ランク","下ランク"]
[null,"L：施設延長(m)",null,{"$f":"$D17","v":30},{"$f":"$D17","v":30},30,30,30,30,30,30,30,null,null,{"$f":"IF(D15<=O23,1,IF(D15<=O24,2,IF(D15<=O25,3,IF(D15<=O26,4,IF(D15<=O27,5,IF(D15<=O28,6,7))))))","v":1},{"$f":"IF(D32>=O28,7,IF(O31=1,1,O31-1))","v":1},null,"内挿パラ↓"]
[null,"係数","a",1.4E-2,3.093,{"$f":"IF(F30<0.2,\"適用外\",IF(F30<=1,0.475*F30+0.945,IF(F30<=10,6.244*F30+2.853,\"適用外\")))","v":34.073},{"$f":"IF(G30<0.3,\"適用外\",IF(G30<=1,1.497*G30-0.1,IF(G30<=10,2.556*G30-2.052,\"適用外\")))","v":10.728000000000002},{"$f":"IF(H29<=1,0.12*H29+0.985,IF(H29<=10,-0.453*H29^2+8.289*H29+0.753,IF(H29<=80,0.747*H29+21.355,\"適用外\")))","v":1.0449999999999999},{"$f":"IF(I29<=1,1.676*I29-0.137,IF(I29<=10,-0.204*I29^2+3.166*I29-1.936,IF(I29<=80,1.265*I29-15.67,\"適用外\")))","v":0.70099999999999996},{"$f":"3.297*J31+1.971*J29+4.663","v":104.55850000000001},"別途算定","別途算定",null,"W",{"$f":"VLOOKUP(O31,$N$23:$O$29,2,FALSE)","v":5},{"$f":"VLOOKUP(P31,$N$23:$O$29,2,FALSE)","v":5},{"$f":"D15","v":0.5},{"$f":"IF(O31=P31,0,(Q32-P32)/(O32-P32))","v":0}]
[null,null,"b",1.2869999999999999,{"$f":"1.34*E29+0.677","v":1.347},{"$f":"IF(F30<0.2,\"適用外\",IF(F30<=1,6.07*F30+1.01,IF(F30<=10,0.93*F30^2+1.606*F30-0.773,\"適用外\")))","v":30.507000000000001},{"$f":"IF(G30<0.3,\"適用外\",IF(G30<=1,1.13*G30^2+0.638*G30-0.011,IF(G30<=10,0.924*G30^2+0.993*G30-0.087,\"適用外\")))","v":27.978000000000002},{"$f":"IF(H29<=1,7.837*H29+0.82,IF(H29<=10,1.458*H29^2+1.27*H29+0.362,IF(H29<=80,1.263*H29^2+4.295*H29-7.649,\"適用外\")))","v":4.7385000000000002},{"$f":"IF(I29<=1,1.496*I29^2+I29*0.671-0.015,IF(I29<=10,1.345*I29^2+0.736*I29+0.251,IF(I29<=80,1.259*I29^2+2.336*I29-8.13,\"適用外\")))","v":0.69450000000000001},{"$f":"(1.401*J29+0.684)*J31+1.214*J29-0.834","v":41.308},"別途算定","別途算定",null,"K",{"$f":"VLOOKUP(O31,$N$23:$X$29,11,FALSE)","v":234.69730179869984},{"$f":"VLOOKUP(P31,$N$23:$X$29,11,FALSE)","v":234.69730179869984},{"$f":"(O33-P33)*R32+P33","v":234.69730179869984}]
[null,null,"c","-","-",{"$f":"IF(F30<0.2,\"適用外\",IF(F30<=1,2.57*F30-0.188,IF(F30<=10,\"-\",\"適用外\")))","v":"-"},{"$f":"IF(G29<=1,2.858*G29-0.283,IF(G29<80,\"-\",\"適用外\"))","v":1.1460000000000001},{"$f":"IF(H29<=1,2.858*H29-0.283,IF(H29<=80,\"-\",\"適用外\"))","v":1.1460000000000001},"-","-","-","-"]
[null,"比浸透量","K",{"$f":"IF(D28<=1.5,D32*D28+D33,\"適用外\")","v":1.2939999999999998},{"$f":"IF(AND(E28<=1.5,E29<=1.5),E32*E28+E33,\"適用外\")","v":2.8935},{"$f":"IF(F30<0.2,\"適用外\",IF(F30<=1,F32*F28^2+F33*F28+F34,IF(F30<=10,F32*F28+F33,\"適用外\")))","v":47.543500000000002},{"$f":"IF(G30<0.3,\"適用外\",IF(G30<10,G32*G30+G33,\"適用外\"))","v":81.618000000000009},{"$f":"IF(H29<=1,H32*H28^2+H33*H28+H34,IF(H29<=80,H32*H28+H33,\"適用外\"))","v":3.7765000000000004},{"$f":"IF(I29<=80,I32*I28+I33,\"適用外\")","v":1.0449999999999999},{"$f":"IF(AND(J28<=1.5,J29<=4,J31<=200),J32*J28+J33,\"適用外\")","v":93.587250000000012},{"$f":"IF(OR(K28<1,K28>5),\"適用外\",Q16)","v":"適用外"},{"$f":"IF(OR(L28<1,L28>5),\"適用外\",Q33)","v":"適用外"}]

{"sheet":"施設諸元（浸透）","index":15,"n_rows":60,"n_cols":21,"rows_kept":60,"cut":false,"hidden":false,"merged":[[5,1,7,1],[5,2,5,3],[5,4,7,4],[6,2,7,2],[6,3,7,3],[19,1,21,1],[19,2,19,3],[19,4,21,4],[19,5,19,7],[19,13,21,13],[20,2,21,2],[20,3,21,3],[5,5,5,7],[5,13,7,13],[33,5,33,7],[33,13,35,13],[19,15,19,16],[5,15,5,16],[20,15,21,15],[20,16,21,16],[20,14,21,14],[33,14,35,14],[33,15,35,15],[6,14,7,14],[6,15,7,15],[6,16,7,16],[47,15,49,15],[48,2,49,2],[48,3,49,3],[34,3,35,3],[47,1,49,1],[47,2,47,3],[47,4,49,4],[47,5,47,7],[47,13,49,13],[34,2,35,2],[33,1,35,1],[33,2,33,3],[33,4,35,4],[47,14,49,14]]}
[null,null,null,null,null,null,null,null,null,null,null,null,null,null,null,null,"【提出様式】",null,null,null,{"$f":"MAX(D9:D18,D23:D32,D37:D46,D51:D60)","v":0}]
["流出抑制施設諸元（浸透施設）"]
[null,"浸透施設諸元",null,null,null,null,null,null,null,null,null,null,null,"空隙貯留量諸元"]
[null,"浸透能力",{"$f":"SUM(J9:J60)/3600","v":0},"m3/s",null,null,null,null,null,null,null,null,null,"空隙貯留量",{"$f":"SUM(K9:K60)","v":0},"m3"]
[]
[null,"【浸透ます】","単位設計浸透能",null,"設置数量\n（個）","影響係数",null,null,null,null,null,null,null,"【浸透ます】\n1個あたり","ます部","砕石部"]
[null,null,"比浸透量（㎡）","飽和透水係数\n（m/hr）",null,"（1）","（2）","（3）",null,null,null,null,null,null,"体積\n（ｍ3）","体積\n（ｍ3）","空隙率\n（％）"]
[null,null,null,null,null,"内容（１）","内容（２）","内容（３）"]
[null,1,null,0,null,0.9,0.9,1,{"$f":"D9","v":0},{"$f":"$C9*$I9*$E9*$F9*$G9*$H9","v":0},{"$f":"($O9+$P9*$Q9/100)*$E9","v":0},null,null,1]
[null,2,null,0,null,0.9,0.9,1,{"$f":"D10","v":0},{"$f":"$C10*$I10*$E10*$F10*$G10*$H10","v":0},{"$f":"($O10+$P10*$Q10/100)*$E10","v":0},null,null,2]
[null,3,null,0,null,0.9,0.9,1,0,0,0,null,null,3]
[null,4,null,0,null,0.9,0.9,1,0,0,0,null,null,4]
[null,5,null,0,null,0.9,0.9,1,0,0,0,null,null,5]
[null,6,null,0,null,0.9,0.9,1,0,0,0,null,null,6]
[null,7,null,0,null,0.9,0.9,1,0,0,0,null,null,7]
[null,8,null,0,null,0.9,0.9,1,0,0,0,null,null,8]
[null,9,null,0,null,0.9,0.9,1,0,0,0,null,null,9]
[null,10,null,0,null,0.9,0.9,1,0,0,0,null,null,10]
[]
[null,"【浸透トレンチ】","単位設計浸透能",null,"設置数量\n（ｍ）","影響係数",null,null,null,null,null,null,null,"【浸透トレンチ】\n1mあたり","浸透管部","砕石部"]
[null,null,"比浸透量（㎡）","飽和透水係数\n（m/hr）",null,"（1）","（2）","（3）",null,null,null,null,null,null,"体積\n（ｍ3）","体積\n（ｍ3）","空隙率\n（％）"]
[null,null,null,null,null,"内容（１）","内容（２）","内容（３）"]
[null,1,null,0,null,0.9,0.9,1,{"$f":"D23","v":0},{"$f":"$C23*$I23*$E23*$F23*$G23*$H23","v":0},{"$f":"($O23+$P23*$Q23/100)*$E23","v":0},null,null,1]
[null,2,null,0,null,0.9,0.9,1,0,{"$f":"$C24*$I24*$E24*$F24*$G24*$H24","v":0},0,null,null,2]
[null,3,null,0,null,0.9,0.9,1,0,0,0,null,null,3]
[null,4,null,0,null,0.9,0.9,1,0,0,0,null,null,4]
[null,5,null,0,null,0.9,0.9,1,0,0,0,null,null,5]
[null,6,null,0,null,0.9,0.9,1,0,0,0,null,null,6]
[null,7,null,0,null,0.9,0.9,1,0,0,0,null,null,7]
[null,8,null,0,null,0.9,0.9,1,0,0,0,null,null,8]
[null,9,null,0,null,0.9,0.9,1,0,0,0,null,null,9]
[null,10,null,0,null,0.9,0.9,1,0,0,0,null,null,10]
[]
[null,"【透水性舗装】","単位設計浸透能",null,"設置数量\n（㎡）","影響係数",null,null,null,null,null,null,null,"【透水性舗装】","体積\n（ｍ3）","空隙率\n（％）"]
[null,null,"比浸透量（㎡）","飽和透水係数\n（m/hr）",null,"（1）","（2）","（3）"]
[null,null,null,null,null,"内容（１）","内容（２）","内容（３）"]
[null,1,null,0,null,0.9,0.9,1,{"$f":"D37","v":0},{"$f":"$C37*$I37*$E37*$F37*$G37*$H37","v":0},{"$f":"$E37*($P37/100*O37)","v":0},null,null,1]
[null,2,null,0,null,0.9,0.9,1,0,{"$f":"$C38*$I38*$E38*$F38*$G38*$H38","v":0},{"$f":"$E38*($P38/100*O38)","v":0},null,null,2]
[null,3,null,0,null,0.9,0.9,1,0,0,0,null,null,3]
[null,4,null,0,null,0.9,0.9,1,0,0,0,null,null,4]
[null,5,null,0,null,0.9,0.9,1,0,0,0,null,null,5]
[null,6,null,0,null,0.9,0.9,1,0,0,0,null,null,6]
[null,7,null,0,null,0.9,0.9,1,0,0,0,null,null,7]
[null,8,null,0,null,0.9,0.9,1,0,0,0,null,null,8]
[null,9,null,0,null,0.9,0.9,1,0,0,0,null,null,9]
[null,10,null,0,null,0.9,0.9,1,0,0,0,null,null,10]
[]
[null,"【その他】","単位設計浸透能",null,"設置数量\n（単位）","影響係数",null,null,null,null,null,null,null,"【その他】","体積\n（ｍ3）","空隙率\n（％）"]
[null,null,"比浸透量（㎡）","飽和透水係数\n（m/hr）",null,"（1）","（2）","（3）"]
[null,null,null,null,null,"内容（１）","内容（２）","内容（３）"]
[null,1,null,0,null,0.9,0.9,1,{"$f":"D51","v":0},{"$f":"$C51*$I51*$E51*$F51*$G51*$H51","v":0},{"$f":"$E51*($P51/100*O51)","v":0},null,null,1]
[null,2,null,0,null,0.9,0.9,1,0,{"$f":"$C52*$I52*$E52*$F52*$G52*$H52","v":0},{"$f":"$E52*($P52/100*O52)","v":0},null,null,2]
[null,3,null,0,null,0.9,0.9,1,0,0,0,null,null,3]
[null,4,null,0,null,0.9,0.9,1,0,0,0,null,null,4]
[null,5,null,0,null,0.9,0.9,1,0,0,0,null,null,5]
[null,6,null,0,null,0.9,0.9,1,0,0,0,null,null,6]
[null,7,null,0,null,0.9,0.9,1,0,0,0,null,null,7]
[null,8,null,0,null,0.9,0.9,1,0,0,0,null,null,8]
[null,9,null,0,null,0.9,0.9,1,0,0,0,null,null,9]
[null,10,null,0,null,0.9,0.9,1,0,0,0,null,null,10]

{"sheet":"施設諸元（浸透_道路管理者用）","index":16,"n_rows":62,"n_cols":19,"rows_kept":62,"cut":false,"hidden":false,"merged":[[10,1,11,1],[10,6,10,7],[11,6,11,7],[4,7,4,8],[6,1,6,6],[8,1,8,2],[9,1,9,2],[9,6,9,7],[19,1,19,2],[19,9,19,10],[12,1,13,1],[12,6,12,7],[13,6,13,7],[14,1,14,6],[15,1,15,3],[16,1,16,2],[16,9,16,10],[17,1,17,2],[17,9,17,10],[18,1,18,2],[18,9,18,10],[20,1,20,2],[20,9,20,10],[21,1,21,2],[21,9,21,10],[22,1,22,2],[22,9,22,10],[25,1,25,6],[27,1,29,2],[27,3,27,4],[27,5,29,5],[27,6,29,6],[28,3,29,3],[28,4,29,4],[27,17,29,17],[27,18,29,18],[28,11,29,11],[28,12,29,12],[28,13,29,13],[35,1,35,2],[27,10,29,10],[27,12,27,13],[27,15,29,15],[27,16,29,16],[27,7,27,8],[28,7,29,7],[28,8,29,8],[30,1,30,2],[31,1,31,2],[32,1,32,2],[33,1,33,2],[34,1,34,2],[42,11,43,11],[36,1,36,2],[37,1,37,2],[38,1,38,2],[39,1,39,2],[41,1,43,2],[41,3,41,4],[53,1,53,2],[42,12,43,12],[42,13,43,13],[44,1,44,2],[45,1,45,2],[46,1,46,2],[47,1,47,2],[41,5,43,5],[41,6,43,6],[41,7,41,8],[41,10,43,10],[41,12,41,13],[42,3,43,3],[42,4,43,4],[42,7,43,7],[42,8,43,8],[48,1,48,2],[49,1,49,2],[50,1,50,2],[51,1,51,2],[52,1,52,2],[56,1,56,2],[56,6,56,7],[57,1,57,2],[58,1,58,2],[59,1,59,6]]}
[null,null,null,null,null,null,null,null,null,null,null,null,null,"【提出様式】"]
["流出抑制施設諸元（浸透施設_道路管理者用）"]
[]
[]
[]
["透水性舗装"]
[]
[null,"基本諸元"]
[null,"設置数量(舗装面積) (m2)"]
[null,"飽和透水係数 （m/hr）",null,null,null,null,"上層路盤での貯留率(%)",null,{"$f":"L21","v":0}]
[null,"比浸透量算定定数\nK=aH+b","a",null,null,null,"下層路盤での貯留率(%)",null,{"$f":"L22","v":0}]
[null,null,"b",null,null,null,"下層路盤厚(mm)",null,{"$f":"D22","v":0}]
[null,"目詰まり\n係数","C1",null,null,null,"下層路盤での貯留量(mm)",null,{"$f":"M22","v":0}]
[null,null,"C2",null,null,null,"貯留量の合計(mm)",null,{"$f":"M23","v":0}]
[]
[null,"貯留率と水拘束率"]
[null,null,null,"厚さ(mm)","空気間隙率\n(%)","空気間隙率との関係","水拘束率\n(%)","水拘束量\n(mm)","貯留率\n(%)","貯留量\n(mm)",null,"STEP2での\n貯留率\n(%)","STEP2での\n貯留量\n(mm)"]
[null,"関係式",null,"a","b","b'","c","a×c/100","d (=b+b')","a×d/100",null,"d-c","a×(d-c)/100"]
[null,"表層",null,null,null,null,null,{"$f":"D19*G19/100","v":0},{"$f":"E19+F19","v":0},{"$f":"D19*I19/100","v":0},null,{"$f":"I19-G19","v":0},{"$f":"D19*(I19-G19)/100","v":0}]
[null,"中間層・基層",null,null,null,null,null,{"$f":"D20*G20/100","v":0},{"$f":"E20+F20","v":0},{"$f":"D20*I20/100","v":0},null,{"$f":"I20-G20","v":0},{"$f":"D20*(I20-G20)/100","v":0}]
[null,"上層路盤",null,null,null,null,null,{"$f":"D21*G21/100","v":0},{"$f":"E21+F21","v":0},{"$f":"D21*I21/100","v":0},null,{"$f":"I21-G21","v":0},{"$f":"D21*(I21-G21)/100","v":0}]
[null,"下層路盤",null,null,null,null,null,{"$f":"D22*G22/100","v":0},{"$f":"E22+F22","v":0},{"$f":"D22*I22/100","v":0},null,{"$f":"I22-G22","v":0},{"$f":"D22*(I22-G22)/100","v":0}]
[null,"合計",null,{"$f":"SUM(D19:D22)","v":0},"-","-","-",{"$f":"SUM(H19:H22)","v":0},"-",{"$f":"SUM(J19:J22)","v":0},null,"-",{"$f":"SUM(M19:M22)","v":0}]
[]
["浸透マス・トレンチ"]
[]
[null,"浸透能諸元",null,null,null,null,null,null,null,null,"空隙貯留諸元"]
[null,"【浸透ます】",null,"単位設計浸透能",null,"設置数量\n（個）","設計水頭\n(m)","影響係数",null,null,"【浸透ます】\n1個あたり","ます部","砕石部",null,null,"Σ","設計浸透量","平均設計水頭","設計空隙貯留量"]
[null,null,null,"比浸透量（㎡）","飽和透水係数\n（cm/s）",null,null,"地下水位\n係数","目詰まり\n係数",null,null,"体積\n（ｍ3）","体積\n（ｍ3）","空隙率\n（％）"]
[null,null,null,null,null,null,null,null,null,null,null,null,null,null,"小計"]
[null,1,null,null,null,null,null,1,1,null,1,null,null,null,null,{"$f":"D31*E31*F31*G31*H31*I31","v":0},{"$f":"D31*E31*F31*H31*I31","v":0},null,{"$f":"L31*M31/100","v":0}]
[null,2,null,null,null,null,null,1,1,null,2,null,null,null,null,{"$f":"D32*E32*F32*G32*H32*I32","v":0},{"$f":"D32*E32*F32*H32*I32","v":0},null,{"$f":"L32*M32/100","v":0}]
[null,3,null,null,null,null,null,1,1,null,3,null,null,null,null,0,0,null,0]
[null,4,null,null,null,null,null,1,1,null,4,null,null,null,null,0,0,null,0]
[null,5,null,null,null,null,null,1,1,null,5,null,null,null,null,0,0,null,0]
[null,6,null,null,null,null,null,1,1,null,6,null,null,null,null,0,0,null,0]
[null,7,null,null,null,null,null,1,1,null,7,null,null,null,null,0,0,null,0]
[null,8,null,null,null,null,null,1,1,null,8,null,null,null,null,0,0,null,0]
[null,9,null,null,null,null,null,1,1,null,9,null,null,null,null,0,0,null,0]
[null,10,null,null,null,null,null,1,1,null,10,null,null,null,null,0,0,null,0]
[]
[null,"【浸透トレンチ】",null,"単位設計浸透能",null,"設置数量\n（ｍ）","設計水頭\n(m)","影響係数",null,null,"【浸透トレンチ】\n1mあたり","浸透管部","砕石部"]
[null,null,null,"比浸透量（㎡）","飽和透水係数\n（cm/s）",null,null,"地下水位\n係数","目詰まり\n係数",null,null,"体積\n（ｍ3）","体積\n（ｍ3）","空隙率\n（％）"]
[]
[null,1,null,null,null,null,null,1,1,null,1,null,null,null,null,{"$f":"D45*E45*F45*G45*H45*I45","v":0},{"$f":"D45*E45*F45*H45*I45","v":0},null,{"$f":"L45*M45/100","v":0}]
[null,2,null,null,null,null,null,1,1,null,2,null,null,null,null,{"$f":"D46*E46*F46*G46*H46*I46","v":0},{"$f":"D46*E46*F46*H46*I46","v":0},null,0]
[null,3,null,null,null,null,null,1,1,null,3,null,null,null,null,0,0,null,0]
[null,4,null,null,null,null,null,1,1,null,4,null,null,null,null,0,0,null,0]
[null,5,null,null,null,null,null,1,1,null,5,null,null,null,null,0,0,null,0]
[null,6,null,null,null,null,null,1,1,null,6,null,null,null,null,0,0,null,0]
[null,7,null,null,null,null,null,1,1,null,7,null,null,null,null,0,0,null,0]
[null,8,null,null,null,null,null,1,1,null,8,null,null,null,null,0,0,null,0]
[null,9,null,null,null,null,null,1,1,null,9,null,null,null,null,0,0,null,0]
[null,10,null,null,null,null,null,1,1,null,10,null,null,null,null,0,0,null,0]
[]
[null,"統合諸元"]
[null,"設計浸透能(m3/hr)",null,{"$f":"Q59","v":0}]
[null,"平均設計水頭(m)",null,{"$f":"IF(D57>0,+R59,0)","v":0}]
[null,"設計空隙貯留量(m3)",null,{"$f":"S59","v":0},null,null,null,null,null,null,null,null,null,null,"総合計",{"$f":"P61+P62","v":0},{"$f":"Q61+Q62","v":0},{"$f":"P59/Q59","v":{"$error":"#DIV/0!"}},{"$f":"S61+S62","v":0}]
[]
[null,null,null,null,null,null,null,null,null,null,null,null,null,null,"マス",{"$f":"SUM(P31:P40)","v":0},{"$f":"SUM(Q31:Q40)","v":0},{"$f":"P61/Q61","v":{"$error":"#DIV/0!"}},{"$f":"SUM(S31:S40)","v":0}]
[null,null,null,null,null,null,null,null,null,null,null,null,null,null,"トレンチ",{"$f":"SUM(P45:P54)","v":0},{"$f":"SUM(Q45:Q54)","v":0},{"$f":"P62/Q62","v":{"$error":"#DIV/0!"}},{"$f":"SUM(S45:S54)","v":0}]

{"sheet":"調節計算結果","index":17,"n_rows":7,"n_cols":9,"rows_kept":7,"cut":false,"hidden":false,"merged":[]}
[null,null,null,null,null,null,null,null,"【提出様式】"]
["調節計算結果（流量ハイドログラフ）　　"]
[null,"【貯留量】"]
[null,"計画貯留施設容量",{"$f":"MAX('施設諸元（自然調節）'!C14:C63)","v":700},"m3","≧","必要貯留施設容量",{"$f":"'コントロールシート（貯留＋浸透）'!G15","v":700},"m3",{"$f":"IF(C4>=G4,\"OK\",\"NG\")","v":"OK"}]
[null,"【放流量】"]
[null,"最大流入量（行為後）",{"$f":"事前相談チェックシート!R13","v":0.77800000000000002},"m3/s"]
[null,"最大放流量",{"$f":"'コントロールシート（貯留＋浸透）'!L18","v":9.4422253028602465E-2},"m3/s","≦","許容放流量",{"$f":"事前相談チェックシート!U25","v":0.1},"m3/s",{"$f":"IF(C7<=G7,\"OK\",\"NG\")","v":"OK"}]

{"sheet":"許可申請書","index":18,"n_rows":53,"n_cols":10,"rows_kept":53,"cut":false,"hidden":false,"merged":[[22,1,23,1],[22,2,23,5],[6,0,6,8],[9,0,9,8],[12,0,12,3],[18,0,28,0],[18,2,18,5],[18,6,18,10],[19,2,19,5],[19,6,19,10],[20,1,21,1],[20,2,21,5],[13,0,13,3],[27,2,27,5],[27,6,27,10],[28,2,28,5],[25,2,25,5],[42,2,44,10],[30,4,30,10],[31,4,31,6],[31,7,31,10],[33,7,34,10],[36,2,37,10],[39,2,41,10],[29,4,29,6],[29,7,29,10],[25,6,25,10],[26,2,26,5],[26,6,26,10],[28,6,28,10],[14,5,15,8],[16,5,17,8],[20,6,21,10],[22,6,23,10],[24,2,24,5],[24,6,24,10]]}
["別記様式第二（第十六条関係）"]
[null,null,null,null,null,null,"許可申請"]
[null,null,null,null,null,"雨水浸透阻害行為",null,"書"]
[null,null,null,null,null,null,"協　　議"]
[]
[null,null,null,null,"　第３０条",null,null,null,null,"※"]
["　特定都市河川浸水被害対策法　　    　　 の規定により、雨水浸透阻害行為",null,null,null,null,null,null,null,null,"手数料欄"]
[null,null,null,null,"第３５条"]
[null,null," 　　 許可を申請"]
["について　　　　　　 します。"]
[null,null,"　 協　　　議"]
[]
["　　年　　月　　日"]
["　　　　　　　 　殿　 "]
[null,null,null,null,"住所",{"$f":"事前相談書!H17","v":0}]
[]
[null,null,null,null,"氏名",{"$f":"事前相談書!H19","v":0}]
[]
["雨水浸透阻害行為等の概要","１","雨水浸透阻害行為の区域に含まれる地域の名称",null,null,null,{"$f":"事前相談書!G8","v":0}]
[null,"２","雨水浸透阻害行為区域の面積",null,null,null,{"$f":"事前相談チェックシート!R5","v":2}]
[null,"３","雨水浸透阻害行為に関する工事の計画の概要",null,null,null,{"$f":"事前相談書!G14","v":0}]
[]
[null,"４","対策工事の計画の概要"]
[]
[null,"５","雨水浸透阻害行為に関する工事の着手予定日",null,null,null,"　　年　　月　　日"]
[null,"６","雨水浸透阻害行為に関する工事の完了予定日",null,null,null,"　　年　　月　　日"]
[null,"７","対策工事の着手予定日",null,null,null,"　　年　　月　　日"]
[null,"８","対策工事の完了予定日",null,null,null,"　　年　　月　　日"]
[null,"９","その他必要な事項"]
["※受付番号",null,null,null,"　　年　　月　　日",null,null,"　　河整指令第　　　　号"]
["※許可に付した条件"]
["※許可番号",null,null,null,"　　年　　月　　日",null,null,"　　河整指令第　　　　号"]
["備考"]
[null,"１","　「許可申請　、 「第３０ 条   、 「許可を申請",null,null,null,null,"については、該当するものを○で"]
[null,null,"　　協　　議」　   第３５条」　　 協　  　議」"]
[null,null,"囲むこと。"]
[null,"２","　許可申請者が法人である場合においては、氏名は、その法人の名称及び代表者の氏名を記載すること。"]
[]
[null,"３","　※印のある欄は記載しないこと。"]
[null,"４","　雨水浸透阻害行為に関する工事の計画及び対策工事の計画については、概要の記述の末尾に「（計画の詳細は、別葉の計画説明書及び計画図による。）」と記載し、それぞれ計画説明書及び計画図を別葉とすること。"]
[]
[]
[null,"５","　「その他の必要な事項」の欄には、雨水浸透阻害行為を行うことについて、都市計画法、農地法その他の法令による許可、認可等を要する場合には、その手続の状況を記載すること。"]
[]
[]
[]
[]
[]
[]
[]
[]
[]
[null,null,null,"　"]

{"sheet":"県条例)様式第1号","index":19,"n_rows":53,"n_cols":22,"rows_kept":53,"cut":false,"hidden":true,"merged":[[9,0,9,8],[9,14,9,22],[12,0,12,3],[12,14,12,17],[6,0,6,10],[6,14,6,24],[14,0,14,3],[14,14,14,17],[19,0,29,0],[19,2,19,5],[19,6,19,10],[19,14,29,14],[19,16,19,19],[25,2,25,5],[25,6,25,10],[25,16,25,19],[27,2,27,5],[27,6,27,10],[27,16,27,19],[29,2,29,5],[29,6,29,10],[29,16,29,19],[19,20,19,24],[20,2,20,5],[20,6,20,10],[20,16,20,19],[20,20,20,24],[21,20,22,24],[23,1,24,1],[23,2,24,5],[23,6,24,10],[23,15,24,15],[23,16,24,19],[23,20,24,24],[21,1,22,1],[21,2,22,5],[21,6,22,10],[21,15,22,15],[21,16,22,19],[25,20,25,24],[26,2,26,5],[26,6,26,10],[26,16,26,19],[26,20,26,24],[27,20,27,24],[28,2,28,5],[28,6,28,10],[28,16,28,19],[28,20,28,24],[29,20,29,24],[30,4,30,6],[30,7,30,10],[30,18,30,20],[30,21,30,24],[15,5,16,10],[17,5,18,10],[39,2,40,10],[41,2,42,10],[39,16,40,24],[41,16,42,24],[34,7,35,10],[34,21,35,24],[37,2,38,10],[37,16,38,24],[31,4,31,10],[31,18,31,24],[32,4,32,6],[32,7,32,10],[32,18,32,20],[32,21,32,24]]}
["様式第１号（第１条関係）",null,null,null,null,null,null,null,null,null,null,null,null,"様式第１号（第１条関係）"]
[null,null,null,null,null,null,"許可申請",null,null,null,null,null,null,null,null,null,null,null,null,null,"許可申請"]
[null,null,null,null,null,"雨水流出増加行為",null,"書",null,null,null,null,null,null,null,null,null,null,null,"雨水流出増加行為",null,"書"]
[null,null,null,null,null,null,"協　　議",null,null,null,null,null,null,null,null,null,null,null,null,null,"協　　議"]
[]
[null,null,null,null,null,"　　　　第３条",null,null,null,null,null,null,null,null,null,null,null,null,null,"　　　　第３条"]
["　埼玉県雨水流出抑制施設の設置等に関する条例　　　　の規定により、雨水流出増加行為に",null,null,null,null,null,null,null,null,null,null,null,null,null,"　埼玉県雨水流出抑制施設の設置等に関する条例　　　　の規定により、雨水流出増加行為に"]
[null,null,null,null,null,"　　　　第６条",null,null,null,null,null,null,null,null,null,null,null,null,null,"　　　　第６条"]
[null,null,"許可を申請",null,null,null,null,null,null,null,null,null,null,null,null,null,"許可を申請"]
["ついて　　　　　　 します。",null,null,null,null,null,null,null,null,null,null,null,null,null,"ついて　　　　　　 します。"]
[null,null,"協　　　議",null,null,null,null,null,null,null,null,null,null,null,null,null,"協　　　議"]
[]
["　　年　　月　　日",null,null,null,null,null,null,null,null,null,null,null,null,null,"　　年　　月　　日"]
[null,null,"（あて先）",null,null,null,null,null,null,null,null,null,null,null,null,null,"（あて先）"]
["埼玉県知事 　殿",null,null,null,null,null,null,null,null,null,null,null,null,null,"埼玉県知事 　殿"]
[null,null,null,null,"住所",{"$f":"事前相談書!H17","v":0},null,null,null,null,null,null,null,null,null,null,null,null,"住所","埼玉県○○市○○町１－１－１"]
[null,null,null,null,null,null,null,null,null,null,null,null,null,null,null,null,null,null,null,"○○○○住宅建設株式会社"]
[null,null,null,null,"氏名",{"$f":"事前相談書!H19","v":0},null,null,null,null,null,null,null,null,null,null,null,null,"氏名","　代表取締役　○○○ ○○"]
[]
["雨水流出増加行為等の概要","１","雨水流出増加行為をする土地の区域に含まれる地域の名称",null,null,null,{"$f":"事前相談書!G8","v":0},null,null,null,null,null,null,null,"雨水流出増加行為等の概要","１","雨水流出増加行為をする土地の区域に含まれる地域の名称",null,null,null,"　○○市○○町100番地、101番地、102番地、103番地"]
[null,"２","雨水流出増加行為をする土地の区域の面積",null,null,null,{"$f":"事前相談チェックシート!R5","v":2},null,null,null,null,null,null,null,null,"２","雨水流出増加行為をする土地の区域の面積",null,null,null,"　0.250ha"]
[null,"３","雨水流出増加行為に関する工事の計画の概要",null,null,null,{"$f":"事前相談書!G14","v":0},null,null,null,null,null,null,null,null,"３","雨水流出増加行為に関する工事の計画の概要",null,null,null,"　分譲住宅（１５宅地）の宅地造成"]
[]
[null,"４","対策工事の計画の概要",null,null,null,null,null,null,null,null,null,null,null,null,"４","対策工事の計画の概要",null,null,null,"　浸透トレンチ00ｍを設置"]
[]
[null,"５","雨水流出増加行為に関する工事の着手予定日",null,null,null,"　　年　　月　　日",null,null,null,null,null,null,null,null,"５","雨水流出増加行為に関する工事の着手予定日",null,null,null,"　○○年○○月○○日"]
[null,"６","雨水流出増加行為に関する工事の完了予定日",null,null,null,"　　年　　月　　日",null,null,null,null,null,null,null,null,"６","雨水流出増加行為に関する工事の完了予定日",null,null,null,"　○○年○○月○○日"]
[null,"７","対策工事の着手予定日",null,null,null,"　　年　　月　　日",null,null,null,null,null,null,null,null,"７","対策工事の着手予定日",null,null,null,"　○○年○○月○○日"]
[null,"８","対策工事の完了予定日",null,null,null,"　　年　　月　　日",null,null,null,null,null,null,null,null,"８","対策工事の完了予定日",null,null,null,"　○○年○○月○○日"]
[null,"９","その他必要な事項",null,null,null,null,null,null,null,null,null,null,null,null,"９","その他必要な事項",null,null,null,"　○○市宅地開発事業に関する条例（開発行為）協議中"]
["※受付番号",null,null,null,"　　年　　月　　日",null,null,"　　河整指令第　　　　号",null,null,null,null,null,null,"※受付番号",null,null,null,"　　年　　月　　日",null,null,"　　河整指令第　　　　号"]
["※許可に付した条件",null,null,null,null,null,null,null,null,null,null,null,null,null,"※許可に付した条件"]
["※許可番号",null,null,null,"　　年　　月　　日",null,null,"　　河整指令第　　　　号",null,null,null,null,null,null,"※許可番号",null,null,null,"　　年　　月　　日",null,null,"　　河整指令第　　　　号"]
["備考",null,null,null,null,null,null,null,null,null,null,null,null,null,"備考"]
[null,"１","　「許可申請　、 「第３条   、 「許可を申請",null,null,null,null,"については、該当するものを○で",null,null,null,null,null,null,null,"１","　「許可申請　、 「第３条   、 「許可を申請",null,null,null,null,"については、該当するものを○で"]
[null,null,"　　協　　議」　   第６条」　　 協　  　議」",null,null,null,null,null,null,null,null,null,null,null,null,null,"　　協　　議」　   第６条」　　 協　  　議」"]
[null,null,"囲むこと。",null,null,null,null,null,null,null,null,null,null,null,null,null,"囲むこと。"]
[null,"２","　許可申請者の氏名（法人にあっては、その代表者の氏名）の記載を自署で行う場合においては、押印を省略することができる。",null,null,null,null,null,null,null,null,null,null,null,null,"２","　許可申請者の氏名（法人にあっては、その代表者の氏名）の記載を自署で行う場合においては、押印を省略することができる。"]
[]
[null,"３","　雨水流出増加行為に関する工事の計画及び対策工事の計画については、概要の記述の末尾に「（計画の詳細は、別添の計画説明書及び計画図による。）」と記載し、それぞれ計画説明書及び計画図を添付すること。",null,null,null,null,null,null,null,null,null,null,null,null,"３","　雨水流出増加行為に関する工事の計画及び対策工事の計画については、概要の記述の末尾に「（計画の詳細は、別添の計画説明書及び計画図による。）」と記載し、それぞれ計画説明書及び計画図を添付すること。"]
[]
[null,"４","　「その他必要な事項」の欄には、雨水流出増加行為を行うことについて、都市計画法、農地法その他の法令による許可、認可等を要する場合には、その手続の状況を記載すること。",null,null,null,null,null,null,null,null,null,null,null,null,"４","　「その他必要な事項」の欄には、雨水流出増加行為を行うことについて、都市計画法、農地法その他の法令による許可、認可等を要する場合には、その手続の状況を記載すること。"]
[]
[null,"５","　※印のある欄は記載しないこと。",null,null,null,null,null,null,null,null,null,null,null,null,"５","　※印のある欄は記載しないこと。"]
[]
[]
[]
[]
[]
[]
[]
[null,null,null,"　"]
[null,null,null,null,null,null,null,null,null,null,null,null,null,null,null,null,null,"　"]

{"sheet":"計画説明書","index":20,"n_rows":27,"n_cols":11,"rows_kept":27,"cut":false,"hidden":false,"merged":[[21,4,21,6],[21,7,21,10],[22,4,24,6],[22,7,24,10],[25,1,25,10],[26,0,26,10],[21,1,24,3],[19,0,24,0],[1,0,1,10],[9,0,13,0],[9,1,10,1],[9,2,10,2],[9,3,10,3],[9,4,10,4],[2,1,2,10],[3,1,3,10],[4,1,4,10],[5,1,5,10],[6,1,6,10],[7,1,7,10],[8,1,8,10],[14,0,18,0],[14,1,15,1],[14,2,15,2],[14,3,15,3],[14,4,15,4],[19,6,19,8],[19,9,19,10],[20,1,20,3],[20,4,20,5],[20,6,20,8],[20,9,20,10],[19,1,19,3],[19,4,19,5]]}
["様式－１（特定都市河川浸水被害対策法施行規則 第16条関係）"]
["計　画　説　明　書"]
["申請者"]
["設計者"]
["工事施工者"]
["施工管理者"]
["雨水浸透阻害行為の区域に含まれる地域の名称",{"$f":"事前相談書!G8","v":0}]
["雨水浸透阻害行為に関する工事及び対策工事の計画の方針"]
["対策工事の計画の概要"]
["行為区域(対策工事に係る雨水貯留浸透施設の集水区域が行為区域の範囲を超えるときは、当該超える区域を含む。)内の土地の現況(m2)","宅　地","池　沼","水　路","ため池","道　路","道　路","鉄道線路","鉄道線路","飛行場","飛行場"]
[null,null,null,null,null,"(法面無)","(法面有)","(法面無)","(法面有)","(法面無)","(法面有)"]
[null,{"$f":"'様式－Ａ'!B22*10000","v":10000},{"$f":"'様式－Ａ'!C22*10000","v":0},{"$f":"'様式－Ａ'!D22*10000","v":0},{"$f":"'様式－Ａ'!E22*10000","v":0},{"$f":"'様式－Ａ'!F22*10000","v":0},{"$f":"'様式－Ａ'!G22*10000","v":0},{"$f":"'様式－Ａ'!H22*10000","v":0},{"$f":"'様式－Ａ'!I22*10000","v":0},{"$f":"'様式－Ａ'!J22*10000","v":0},{"$f":"'様式－Ａ'!K22*10000","v":0}]
[null,"太陽光\nパネル","舗装された土地(法面を除く。)","舗装された土地(法面)","ゴルフ場","運動場","締め固められた土地","山　地","植生に覆われた法面","林地・耕地・原野その他","合　計"]
[null,{"$f":"'様式－Ａ'!L22*10000","v":0},{"$f":"'様式－Ａ'!M22*10000","v":0},{"$f":"'様式－Ａ'!N22*10000","v":0},{"$f":"'様式－Ａ'!O22*10000","v":0},{"$f":"'様式－Ａ'!P22*10000","v":0},{"$f":"'様式－Ａ'!Q22*10000","v":0},{"$f":"'様式－Ａ'!R22*10000","v":0},{"$f":"'様式－Ａ'!S22*10000","v":0},{"$f":"'様式－Ａ'!T22*10000","v":10000},{"$f":"SUM(B12:K12,B14:J14)","v":20000}]
["行為区域(対策工事に係る雨水貯留浸透施設の集水区域が行為区域の範囲を超えるときは、当該超える区域を含む。)内の土地利用計画(m2)","宅　地","池　沼","水　路","ため池","道　路","道　路","鉄道線路","鉄道線路","飛行場","飛行場"]
[null,null,null,null,null,"(法面無)","(法面有)","(法面無)","(法面有)","(法面無)","(法面有)"]
[null,{"$f":"'様式－Ｂ'!B22*10000","v":20000},{"$f":"'様式－Ｂ'!C22*10000","v":0},{"$f":"'様式－Ｂ'!D22*10000","v":0},{"$f":"'様式－Ｂ'!E22*10000","v":0},{"$f":"'様式－Ｂ'!F22*10000","v":0},{"$f":"'様式－Ｂ'!G22*10000","v":0},{"$f":"'様式－Ｂ'!H22*10000","v":0},{"$f":"'様式－Ｂ'!I22*10000","v":0},{"$f":"'様式－Ｂ'!J22*10000","v":0},{"$f":"'様式－Ｂ'!K22*10000","v":0}]
[null,"太陽光\nパネル","舗装された土地(法面を除く。)","舗装された土地(法面)","ゴルフ場","運動場","締め固められた土地","山　地","植生に覆われた法面","林地・耕地・原野その他","合　計"]
[null,{"$f":"'様式－Ｂ'!L22*10000","v":0},{"$f":"'様式－Ｂ'!M22*10000","v":0},{"$f":"'様式－Ｂ'!N22*10000","v":0},{"$f":"'様式－Ｂ'!O22*10000","v":0},{"$f":"'様式－Ｂ'!P22*10000","v":0},{"$f":"'様式－Ｂ'!Q22*10000","v":0},{"$f":"'様式－Ｂ'!R22*10000","v":0},{"$f":"'様式－Ｂ'!S22*10000","v":0},{"$f":"'様式－Ｂ'!T22*10000","v":0},{"$f":"SUM(B17:K17,B19:J19)","v":20000}]
["対策工事に係る雨水貯留浸透施設の計画","行為前の流出係数",null,null,{"$f":"事前相談チェックシート!R10","v":0.55000000000000004},null,"行為後の流出係数",null,null,{"$f":"事前相談チェックシート!R12","v":0.9}]
[null,"行為前の流出雨水量",null,null,{"$f":"事前相談チェックシート!R11","v":0.47543999999999997},null,"行為後の流出雨水量",null,null,{"$f":"事前相談チェックシート!R13","v":0.77800000000000002}]
[null,"雨水貯留浸透施設の計画",null,null,"構造名称",null,null,"容量(浸透能力)"]
[]
[]
[]
["その他"]
["備考"]

{"sheet":"条例)計画説明書","index":21,"n_rows":28,"n_cols":34,"rows_kept":28,"cut":false,"hidden":true,"merged":[[11,1,12,2],[9,1,10,2],[8,1,8,2],[7,1,7,2],[1,0,1,26],[8,15,8,20],[8,21,8,26],[9,3,9,6],[9,7,9,10],[9,11,9,14],[9,15,9,18],[9,19,9,22],[9,23,9,26],[8,9,8,14],[10,23,10,26],[11,3,11,8],[11,21,11,26],[5,3,5,26],[4,3,4,26],[22,1,24,1],[13,0,24,0],[2,0,12,0],[15,2,16,2],[8,3,8,8],[10,3,10,6],[10,7,10,10],[6,1,6,2],[5,1,5,2],[4,1,4,2],[3,1,3,2],[2,1,2,2],[13,1,21,1],[3,3,3,26],[2,3,2,26],[14,3,14,17],[14,18,14,21],[14,22,14,26],[12,3,12,8],[12,9,12,14],[12,15,12,20],[12,21,12,26],[7,3,7,26],[6,3,6,26],[10,11,10,14],[10,15,10,18],[10,19,10,22],[11,9,11,14],[11,15,11,20],[19,2,21,2],[18,13,18,26],[19,3,19,17],[20,3,20,8],[20,9,20,17],[21,3,21,8],[21,9,21,17],[19,18,21,21],[18,3,18,12],[22,18,23,21],[22,22,23,26],[19,22,21,26],[24,3,24,26],[13,3,13,26],[15,3,15,6],[15,18,17,21],[15,22,17,26],[16,3,16,6],[15,7,15,17],[16,7,16,17],[17,3,17,17],[22,3,22,17],[23,3,23,17]]}
["様式Ａ（規則第４条、第１５条関係）"]
["計画説明書"]
["開発の概要","申請者"]
[null,"設計者"]
[null,"工事施工者"]
[null,"雨水流出増加行為（盛土行為）をする土地の区域に含まれる地域の名称"]
[null,"雨水流出増加行為（盛土行為）に関する工事の計画の概要"]
[null,"対策工事の計画の概要"]
[null,"地域別調整容量",null,"貯留調整容量Va(m3/ha)",null,null,null,null,null,{"$f":"事前相談チェックシート!V16","v":700},null,null,null,null,null,"浸透調整容量Vb(m3/s/ha)",null,null,null,null,null,{"$f":"事前相談チェックシート!AB8","v":0.43090000000000001}]
[null,"雨水流出増加量",null,"計画区域の面積(m2)",null,null,null,"行為前宅地等面積(m2)",null,null,null,"行為後生産緑地面積(m2)",null,null,null,"行為後森林面積(m2)",null,null,null,"流出抑制対象面積(m2)",null,null,null,"雨水流出増加量(m3)"]
[null,null,null,{"$f":"事前相談チェックシート!M28*10000","v":20000},null,null,null,{"$f":"(事前相談チェックシート!L16+事前相談チェックシート!L19)*10000","v":10000},null,null,null,{"$f":"事前相談入力シート!$V$46","v":0},null,null,null,{"$f":"事前相談入力シート!$W$46","v":0},null,null,null,{"$f":"D11-H11","v":10000},null,null,null,{"$f":"T11*J9/10000","v":700}]
[null,"盛土行為に対する必要対策量",null,"盛土面積(m2)",null,null,null,null,null,"平均湛水深(m)",null,null,null,null,null,"最大盛土厚さ(m)",null,null,null,null,null,"盛土行為に対する必要対策量(m3)"]
[]
["流出抑制施設","貯留型","貯留施設の構造"]
[null,null,"貯留施設の貯留量",{"$f":"IF(D20=\"自然流下\",'コントロールシート（貯留＋浸透）'!L16,'コントロールシート（貯留＋浸透）'!#REF!)","v":700},null,null,null,null,null,null,null,null,null,null,null,null,null,null,"貯留施設面積",null,null,null,{"$f":"D15/W16","v":700}]
[null,null,"一次放流先の概要","管理者",null,null,null,null,null,null,null,null,null,null,null,null,null,null,"貯留施設水深",null,null,null,{"$f":"事前相談チェックシート!R9","v":1}]
[null,null,null,"名称"]
[null,null,"流末河川"]
[null,null,"貯留施設多目的利用","無",null,null,null,null,null,null,null,null,null,"有の場合（　　　　　　　　　　　　　　　　）",null,null,null,null,null,null,null,null,null,null,null,null,null,null,null,null,null,null,null,"有"]
[null,null,"排水方法","自然流下",null,null,null,null,null,null,null,null,null,null,null,null,null,null,"放流量の調整方法",null,null,null,{"$f":"IF(D20=\"自然流下\",\"オリフィスの能力による\",\"ポンプの能力による\")","v":"オリフィスの能力による"},null,null,null,null,null,null,null,null,null,null,"無"]
[null,null,null,"許容放流量",null,null,null,null,null,{"$f":"'様式－E'!D53","v":0.1}]
[null,null,null,"放流量",null,null,null,null,null,{"$f":"IF(D20=\"自然流下\",'コントロールシート（貯留＋浸透）'!L18,'コントロールシート（貯留＋浸透）'!#REF!)","v":9.4422253028602465E-2},null,null,null,null,null,null,null,null,null,null,null,null,null,null,null,null,null,null,null,null,null,null,null,"ポンプ"]
[null,"浸透型","雨水浸透施設効果量",{"$f":"'施設諸元（浸透）'!C4","v":0},null,null,null,null,null,null,null,null,null,null,null,null,null,null,"飽和透水係数",null,null,null,{"$f":"'施設諸元（浸透）'!U1","v":0},null,null,null,null,null,null,null,null,null,null,"自然流下"]
[null,null,"浸透施設空隙貯留量",{"$f":"'施設諸元（浸透）'!O4","v":0},null,null,null,null,null,null,null,null,null,null,null,null,null,null,null,null,null,null,null,null,null,null,null,null,null,null,null,null,null,"オリフィスの能力による"]
[null,null,"浸透施設の諸元",null,null,null,null,null,null,null,null,null,null,null,null,null,null,null,null,null,null,null,null,null,null,null,null,null,null,null,null,null,null,"ポンプの能力による"]
[]
[null,null,null,null,null,null,null,null,null,null,null,null,null,null,null,null,null,null,null,null,null,null,null,null,null,null,null,null,"自然排水"]
[null,null,null,null,null,null,null,null,null,null,null,null,null,null,null,null,null,null,null,null,null,null,null,null,null,null,null,null,"ポンプ排水"]

{"sheet":"mkrain","index":22,"n_rows":147,"n_cols":8,"rows_kept":147,"cut":false,"hidden":true,"merged":[]}
[null,"降雨ハイエト",null,null,null,null,{"$f":"MAX(G4:G147)","v":155.6}]
[null,"埼玉県南部","埼玉県北部","東京都","茨城県",null,"対象エリア"]
[]
[null,4.0869999999999997,2.9617,4.0747,2.6570999999999998,1,{"$f":"ROUND(IF(事前相談チェックシート!$U$4=mkrain!B$2,mkrain!B4,IF(事前相談チェックシート!$U$4=mkrain!C$2,mkrain!C4,IF(事前相談チェックシート!$U$4=mkrain!D$2,mkrain!D4,mkrain!E4))),1)","v":4.0999999999999996},"対象エリアによって参照を変更する"]
[null,4.1269,2.9901,4.1143000000000001,2.6827999999999999,2,{"$f":"ROUND(IF(事前相談チェックシート!$U$4=mkrain!B$2,mkrain!B5,IF(事前相談チェックシート!$U$4=mkrain!C$2,mkrain!C5,IF(事前相談チェックシート!$U$4=mkrain!D$2,mkrain!D5,mkrain!E5))),1)","v":4.0999999999999996}]
[null,4.1677,3.0192000000000001,4.1548999999999996,2.7090999999999998,3,{"$f":"ROUND(IF(事前相談チェックシート!$U$4=mkrain!B$2,mkrain!B6,IF(事前相談チェックシート!$U$4=mkrain!C$2,mkrain!C6,IF(事前相談チェックシート!$U$4=mkrain!D$2,mkrain!D6,mkrain!E6))),1)","v":4.2}]
[null,4.2096,3.0489999999999999,4.1966000000000001,2.7361,4,{"$f":"ROUND(IF(事前相談チェックシート!$U$4=mkrain!B$2,mkrain!B7,IF(事前相談チェックシート!$U$4=mkrain!C$2,mkrain!C7,IF(事前相談チェックシート!$U$4=mkrain!D$2,mkrain!D7,mkrain!E7))),1)","v":4.2}]
[null,4.2525000000000004,3.0794999999999999,4.2393000000000001,2.7637999999999998,5,{"$f":"ROUND(IF(事前相談チェックシート!$U$4=mkrain!B$2,mkrain!B8,IF(事前相談チェックシート!$U$4=mkrain!C$2,mkrain!C8,IF(事前相談チェックシート!$U$4=mkrain!D$2,mkrain!D8,mkrain!E8))),1)","v":4.3}]
[null,4.2965,3.1107999999999998,4.2830000000000004,2.7921,6,{"$f":"ROUND(IF(事前相談チェックシート!$U$4=mkrain!B$2,mkrain!B9,IF(事前相談チェックシート!$U$4=mkrain!C$2,mkrain!C9,IF(事前相談チェックシート!$U$4=mkrain!D$2,mkrain!D9,mkrain!E9))),1)","v":4.3}]
[null,4.3417000000000003,3.1429999999999998,4.3280000000000003,2.8212000000000002,7,{"$f":"ROUND(IF(事前相談チェックシート!$U$4=mkrain!B$2,mkrain!B10,IF(事前相談チェックシート!$U$4=mkrain!C$2,mkrain!C10,IF(事前相談チェックシート!$U$4=mkrain!D$2,mkrain!D10,mkrain!E10))),1)","v":4.3}]
[null,4.3879999999999999,3.1760000000000002,4.3741000000000003,2.8511000000000002,8,{"$f":"ROUND(IF(事前相談チェックシート!$U$4=mkrain!B$2,mkrain!B11,IF(事前相談チェックシート!$U$4=mkrain!C$2,mkrain!C11,IF(事前相談チェックシート!$U$4=mkrain!D$2,mkrain!D11,mkrain!E11))),1)","v":4.4000000000000004}]
[null,4.4356,3.2098,4.4214000000000002,2.8816999999999999,9,{"$f":"ROUND(IF(事前相談チェックシート!$U$4=mkrain!B$2,mkrain!B12,IF(事前相談チェックシート!$U$4=mkrain!C$2,mkrain!C12,IF(事前相談チェックシート!$U$4=mkrain!D$2,mkrain!D12,mkrain!E12))),1)","v":4.4000000000000004}]
[null,4.4844999999999997,3.2446000000000002,4.47,2.9131999999999998,10,{"$f":"ROUND(IF(事前相談チェックシート!$U$4=mkrain!B$2,mkrain!B13,IF(事前相談チェックシート!$U$4=mkrain!C$2,mkrain!C13,IF(事前相談チェックシート!$U$4=mkrain!D$2,mkrain!D13,mkrain!E13))),1)","v":4.5}]
[null,4.5347999999999997,3.2803,4.5199999999999996,2.9456000000000002,11,{"$f":"ROUND(IF(事前相談チェックシート!$U$4=mkrain!B$2,mkrain!B14,IF(事前相談チェックシート!$U$4=mkrain!C$2,mkrain!C14,IF(事前相談チェックシート!$U$4=mkrain!D$2,mkrain!D14,mkrain!E14))),1)","v":4.5}]
[null,4.5864000000000003,3.3170000000000002,4.5713999999999997,2.9788999999999999,12,{"$f":"ROUND(IF(事前相談チェックシート!$U$4=mkrain!B$2,mkrain!B15,IF(事前相談チェックシート!$U$4=mkrain!C$2,mkrain!C15,IF(事前相談チェックシート!$U$4=mkrain!D$2,mkrain!D15,mkrain!E15))),1)","v":4.5999999999999996}]
[null,4.6395999999999997,3.3548,4.6242000000000001,3.0131000000000001,13,{"$f":"ROUND(IF(事前相談チェックシート!$U$4=mkrain!B$2,mkrain!B16,IF(事前相談チェックシート!$U$4=mkrain!C$2,mkrain!C16,IF(事前相談チェックシート!$U$4=mkrain!D$2,mkrain!D16,mkrain!E16))),1)","v":4.5999999999999996}]
[null,4.6943000000000001,3.3936000000000002,4.6786000000000003,3.0482999999999998,14,{"$f":"ROUND(IF(事前相談チェックシート!$U$4=mkrain!B$2,mkrain!B17,IF(事前相談チェックシート!$U$4=mkrain!C$2,mkrain!C17,IF(事前相談チェックシート!$U$4=mkrain!D$2,mkrain!D17,mkrain!E17))),1)","v":4.7}]
[null,4.7506000000000004,3.4336000000000002,4.7346000000000004,3.0844999999999998,15,{"$f":"ROUND(IF(事前相談チェックシート!$U$4=mkrain!B$2,mkrain!B18,IF(事前相談チェックシート!$U$4=mkrain!C$2,mkrain!C18,IF(事前相談チェックシート!$U$4=mkrain!D$2,mkrain!D18,mkrain!E18))),1)","v":4.8}]
[null,4.8086000000000002,3.4748000000000001,4.7923,3.1219000000000001,16,{"$f":"ROUND(IF(事前相談チェックシート!$U$4=mkrain!B$2,mkrain!B19,IF(事前相談チェックシート!$U$4=mkrain!C$2,mkrain!C19,IF(事前相談チェックシート!$U$4=mkrain!D$2,mkrain!D19,mkrain!E19))),1)","v":4.8}]
[null,4.8684000000000003,3.5171999999999999,4.8517999999999999,3.1602999999999999,17,{"$f":"ROUND(IF(事前相談チェックシート!$U$4=mkrain!B$2,mkrain!B20,IF(事前相談チェックシート!$U$4=mkrain!C$2,mkrain!C20,IF(事前相談チェックシート!$U$4=mkrain!D$2,mkrain!D20,mkrain!E20))),1)","v":4.9000000000000004}]
[null,4.9301000000000004,3.5609000000000002,4.9131,3.2,18,{"$f":"ROUND(IF(事前相談チェックシート!$U$4=mkrain!B$2,mkrain!B21,IF(事前相談チェックシート!$U$4=mkrain!C$2,mkrain!C21,IF(事前相談チェックシート!$U$4=mkrain!D$2,mkrain!D21,mkrain!E21))),1)","v":4.9000000000000004}]
[null,4.9936999999999996,3.6059999999999999,4.9763999999999999,3.2410000000000001,19,{"$f":"ROUND(IF(事前相談チェックシート!$U$4=mkrain!B$2,mkrain!B22,IF(事前相談チェックシート!$U$4=mkrain!C$2,mkrain!C22,IF(事前相談チェックシート!$U$4=mkrain!D$2,mkrain!D22,mkrain!E22))),1)","v":5}]
[null,5.0594000000000001,3.6526000000000001,5.0416999999999996,3.2831999999999999,20,{"$f":"ROUND(IF(事前相談チェックシート!$U$4=mkrain!B$2,mkrain!B23,IF(事前相談チェックシート!$U$4=mkrain!C$2,mkrain!C23,IF(事前相談チェックシート!$U$4=mkrain!D$2,mkrain!D23,mkrain!E23))),1)","v":5.0999999999999996}]
[null,5.1273,3.7006999999999999,5.1092000000000004,3.3269000000000002,21,{"$f":"ROUND(IF(事前相談チェックシート!$U$4=mkrain!B$2,mkrain!B24,IF(事前相談チェックシート!$U$4=mkrain!C$2,mkrain!C24,IF(事前相談チェックシート!$U$4=mkrain!D$2,mkrain!D24,mkrain!E24))),1)","v":5.0999999999999996}]
[null,5.1974999999999998,3.7504,5.1790000000000003,3.3719999999999999,22,{"$f":"ROUND(IF(事前相談チェックシート!$U$4=mkrain!B$2,mkrain!B25,IF(事前相談チェックシート!$U$4=mkrain!C$2,mkrain!C25,IF(事前相談チェックシート!$U$4=mkrain!D$2,mkrain!D25,mkrain!E25))),1)","v":5.2}]
[null,5.2701000000000002,3.8018000000000001,5.2511999999999999,3.4186999999999999,23,{"$f":"ROUND(IF(事前相談チェックシート!$U$4=mkrain!B$2,mkrain!B26,IF(事前相談チェックシート!$U$4=mkrain!C$2,mkrain!C26,IF(事前相談チェックシート!$U$4=mkrain!D$2,mkrain!D26,mkrain!E26))),1)","v":5.3}]
[null,5.3452999999999999,3.855,5.3258999999999999,3.4670000000000001,24,{"$f":"ROUND(IF(事前相談チェックシート!$U$4=mkrain!B$2,mkrain!B27,IF(事前相談チェックシート!$U$4=mkrain!C$2,mkrain!C27,IF(事前相談チェックシート!$U$4=mkrain!D$2,mkrain!D27,mkrain!E27))),1)","v":5.3}]
[null,5.4231999999999996,3.9100999999999999,5.4032999999999998,3.5171000000000001,25,{"$f":"ROUND(IF(事前相談チェックシート!$U$4=mkrain!B$2,mkrain!B28,IF(事前相談チェックシート!$U$4=mkrain!C$2,mkrain!C28,IF(事前相談チェックシート!$U$4=mkrain!D$2,mkrain!D28,mkrain!E28))),1)","v":5.4}]
[null,5.5038999999999998,3.9672000000000001,5.4836,3.5689000000000002,26,{"$f":"ROUND(IF(事前相談チェックシート!$U$4=mkrain!B$2,mkrain!B29,IF(事前相談チェックシート!$U$4=mkrain!C$2,mkrain!C29,IF(事前相談チェックシート!$U$4=mkrain!D$2,mkrain!D29,mkrain!E29))),1)","v":5.5}]
[null,5.5876999999999999,4.0265000000000004,5.5667999999999997,3.6227,27,{"$f":"ROUND(IF(事前相談チェックシート!$U$4=mkrain!B$2,mkrain!B30,IF(事前相談チェックシート!$U$4=mkrain!C$2,mkrain!C30,IF(事前相談チェックシート!$U$4=mkrain!D$2,mkrain!D30,mkrain!E30))),1)","v":5.6}]
[null,5.6746999999999996,4.0879000000000003,5.6532999999999998,3.6785999999999999,28,{"$f":"ROUND(IF(事前相談チェックシート!$U$4=mkrain!B$2,mkrain!B31,IF(事前相談チェックシート!$U$4=mkrain!C$2,mkrain!C31,IF(事前相談チェックシート!$U$4=mkrain!D$2,mkrain!D31,mkrain!E31))),1)","v":5.7}]
[null,5.7651000000000003,4.1517999999999997,5.7431000000000001,3.7366999999999999,29,{"$f":"ROUND(IF(事前相談チェックシート!$U$4=mkrain!B$2,mkrain!B32,IF(事前相談チェックシート!$U$4=mkrain!C$2,mkrain!C32,IF(事前相談チェックシート!$U$4=mkrain!D$2,mkrain!D32,mkrain!E32))),1)","v":5.8}]
[null,5.8590999999999998,4.2182000000000004,5.8365999999999998,3.7970999999999999,30,{"$f":"ROUND(IF(事前相談チェックシート!$U$4=mkrain!B$2,mkrain!B33,IF(事前相談チェックシート!$U$4=mkrain!C$2,mkrain!C33,IF(事前相談チェックシート!$U$4=mkrain!D$2,mkrain!D33,mkrain!E33))),1)","v":5.9}]
[null,5.9570999999999996,4.2873000000000001,5.9339000000000004,3.8599000000000001,31,{"$f":"ROUND(IF(事前相談チェックシート!$U$4=mkrain!B$2,mkrain!B34,IF(事前相談チェックシート!$U$4=mkrain!C$2,mkrain!C34,IF(事前相談チェックシート!$U$4=mkrain!D$2,mkrain!D34,mkrain!E34))),1)","v":6}]
[null,6.0590999999999999,4.3593000000000002,6.0354000000000001,3.9253999999999998,32,{"$f":"ROUND(IF(事前相談チェックシート!$U$4=mkrain!B$2,mkrain!B35,IF(事前相談チェックシート!$U$4=mkrain!C$2,mkrain!C35,IF(事前相談チェックシート!$U$4=mkrain!D$2,mkrain!D35,mkrain!E35))),1)","v":6.1}]
[null,6.1656000000000004,4.4344000000000001,6.1412000000000004,3.9937999999999998,33,{"$f":"ROUND(IF(事前相談チェックシート!$U$4=mkrain!B$2,mkrain!B36,IF(事前相談チェックシート!$U$4=mkrain!C$2,mkrain!C36,IF(事前相談チェックシート!$U$4=mkrain!D$2,mkrain!D36,mkrain!E36))),1)","v":6.2}]
[null,6.2767999999999997,4.5126999999999997,6.2516999999999996,4.0651000000000002,34,{"$f":"ROUND(IF(事前相談チェックシート!$U$4=mkrain!B$2,mkrain!B37,IF(事前相談チェックシート!$U$4=mkrain!C$2,mkrain!C37,IF(事前相談チェックシート!$U$4=mkrain!D$2,mkrain!D37,mkrain!E37))),1)","v":6.3}]
[null,6.3930999999999996,4.5946999999999996,6.3673000000000002,4.1397000000000004,35,{"$f":"ROUND(IF(事前相談チェックシート!$U$4=mkrain!B$2,mkrain!B38,IF(事前相談チェックシート!$U$4=mkrain!C$2,mkrain!C38,IF(事前相談チェックシート!$U$4=mkrain!D$2,mkrain!D38,mkrain!E38))),1)","v":6.4}]
[null,6.5148999999999999,4.6803999999999997,6.4882,4.2178000000000004,36,{"$f":"ROUND(IF(事前相談チェックシート!$U$4=mkrain!B$2,mkrain!B39,IF(事前相談チェックシート!$U$4=mkrain!C$2,mkrain!C39,IF(事前相談チェックシート!$U$4=mkrain!D$2,mkrain!D39,mkrain!E39))),1)","v":6.5}]
[null,6.6425000000000001,4.7702,6.6150000000000002,4.2996999999999996,37,{"$f":"ROUND(IF(事前相談チェックシート!$U$4=mkrain!B$2,mkrain!B40,IF(事前相談チェックシート!$U$4=mkrain!C$2,mkrain!C40,IF(事前相談チェックシート!$U$4=mkrain!D$2,mkrain!D40,mkrain!E40))),1)","v":6.6}]
[null,6.7765000000000004,4.8643999999999998,6.7481999999999998,4.3855000000000004,38,{"$f":"ROUND(IF(事前相談チェックシート!$U$4=mkrain!B$2,mkrain!B41,IF(事前相談チェックシート!$U$4=mkrain!C$2,mkrain!C41,IF(事前相談チェックシート!$U$4=mkrain!D$2,mkrain!D41,mkrain!E41))),1)","v":6.8}]
[null,6.9173,4.9634,6.8880999999999997,4.4757999999999996,39,{"$f":"ROUND(IF(事前相談チェックシート!$U$4=mkrain!B$2,mkrain!B42,IF(事前相談チェックシート!$U$4=mkrain!C$2,mkrain!C42,IF(事前相談チェックシート!$U$4=mkrain!D$2,mkrain!D42,mkrain!E42))),1)","v":6.9}]
[null,7.0655000000000001,5.0675999999999997,7.0353000000000003,4.5708000000000002,40,{"$f":"ROUND(IF(事前相談チェックシート!$U$4=mkrain!B$2,mkrain!B43,IF(事前相談チェックシート!$U$4=mkrain!C$2,mkrain!C43,IF(事前相談チェックシート!$U$4=mkrain!D$2,mkrain!D43,mkrain!E43))),1)","v":7.1}]
[null,7.2218,5.1773999999999996,7.1905999999999999,4.6710000000000003,41,{"$f":"ROUND(IF(事前相談チェックシート!$U$4=mkrain!B$2,mkrain!B44,IF(事前相談チェックシート!$U$4=mkrain!C$2,mkrain!C44,IF(事前相談チェックシート!$U$4=mkrain!D$2,mkrain!D44,mkrain!E44))),1)","v":7.2}]
[null,7.3868999999999998,5.2933000000000003,7.3547000000000002,4.7766999999999999,42,{"$f":"ROUND(IF(事前相談チェックシート!$U$4=mkrain!B$2,mkrain!B45,IF(事前相談チェックシート!$U$4=mkrain!C$2,mkrain!C45,IF(事前相談チェックシート!$U$4=mkrain!D$2,mkrain!D45,mkrain!E45))),1)","v":7.4}]
[null,7.5616000000000003,5.4157999999999999,7.5282,4.8886000000000003,43,{"$f":"ROUND(IF(事前相談チェックシート!$U$4=mkrain!B$2,mkrain!B46,IF(事前相談チェックシート!$U$4=mkrain!C$2,mkrain!C46,IF(事前相談チェックシート!$U$4=mkrain!D$2,mkrain!D46,mkrain!E46))),1)","v":7.6}]
[null,7.7468000000000004,5.5457000000000001,7.7122000000000002,5.0072000000000001,44,{"$f":"ROUND(IF(事前相談チェックシート!$U$4=mkrain!B$2,mkrain!B47,IF(事前相談チェックシート!$U$4=mkrain!C$2,mkrain!C47,IF(事前相談チェックシート!$U$4=mkrain!D$2,mkrain!D47,mkrain!E47))),1)","v":7.7}]
[null,7.9436,5.6836000000000002,7.9076000000000004,5.1332000000000004,45,{"$f":"ROUND(IF(事前相談チェックシート!$U$4=mkrain!B$2,mkrain!B48,IF(事前相談チェックシート!$U$4=mkrain!C$2,mkrain!C48,IF(事前相談チェックシート!$U$4=mkrain!D$2,mkrain!D48,mkrain!E48))),1)","v":7.9}]
[null,8.1531000000000002,5.8303000000000003,8.1158000000000001,5.2674000000000003,46,{"$f":"ROUND(IF(事前相談チェックシート!$U$4=mkrain!B$2,mkrain!B49,IF(事前相談チェックシート!$U$4=mkrain!C$2,mkrain!C49,IF(事前相談チェックシート!$U$4=mkrain!D$2,mkrain!D49,mkrain!E49))),1)","v":8.1999999999999993}]
[null,8.3766999999999996,5.9867999999999997,8.3378999999999994,5.4104999999999999,47,{"$f":"ROUND(IF(事前相談チェックシート!$U$4=mkrain!B$2,mkrain!B50,IF(事前相談チェックシート!$U$4=mkrain!C$2,mkrain!C50,IF(事前相談チェックシート!$U$4=mkrain!D$2,mkrain!D50,mkrain!E50))),1)","v":8.4}]
[null,8.6159999999999997,6.1542000000000003,8.5755999999999997,5.5636000000000001,48,{"$f":"ROUND(IF(事前相談チェックシート!$U$4=mkrain!B$2,mkrain!B51,IF(事前相談チェックシート!$U$4=mkrain!C$2,mkrain!C51,IF(事前相談チェックシート!$U$4=mkrain!D$2,mkrain!D51,mkrain!E51))),1)","v":8.6}]
[null,8.8727,6.3337000000000003,8.8306000000000004,5.7279,49,{"$f":"ROUND(IF(事前相談チェックシート!$U$4=mkrain!B$2,mkrain!B52,IF(事前相談チェックシート!$U$4=mkrain!C$2,mkrain!C52,IF(事前相談チェックシート!$U$4=mkrain!D$2,mkrain!D52,mkrain!E52))),1)","v":8.9}]
[null,9.1491000000000007,6.5267999999999997,9.1051000000000002,5.9047000000000001,50,{"$f":"ROUND(IF(事前相談チェックシート!$U$4=mkrain!B$2,mkrain!B53,IF(事前相談チェックシート!$U$4=mkrain!C$2,mkrain!C53,IF(事前相談チェックシート!$U$4=mkrain!D$2,mkrain!D53,mkrain!E53))),1)","v":9.1}]
[null,9.4474999999999998,6.7351999999999999,9.4016000000000002,6.0956000000000001,51,{"$f":"ROUND(IF(事前相談チェックシート!$U$4=mkrain!B$2,mkrain!B54,IF(事前相談チェックシート!$U$4=mkrain!C$2,mkrain!C54,IF(事前相談チェックシート!$U$4=mkrain!D$2,mkrain!D54,mkrain!E54))),1)","v":9.4}]
[null,9.7708999999999993,6.9608999999999996,9.7227999999999994,6.3025000000000002,52,{"$f":"ROUND(IF(事前相談チェックシート!$U$4=mkrain!B$2,mkrain!B55,IF(事前相談チェックシート!$U$4=mkrain!C$2,mkrain!C55,IF(事前相談チェックシート!$U$4=mkrain!D$2,mkrain!D55,mkrain!E55))),1)","v":9.8000000000000007}]
[null,10.1229,7.2064000000000004,10.0725,6.5277000000000003,53,{"$f":"ROUND(IF(事前相談チェックシート!$U$4=mkrain!B$2,mkrain!B56,IF(事前相談チェックシート!$U$4=mkrain!C$2,mkrain!C56,IF(事前相談チェックシート!$U$4=mkrain!D$2,mkrain!D56,mkrain!E56))),1)","v":10.1}]
[null,10.5075,7.4745999999999997,10.454599999999999,6.7736999999999998,54,{"$f":"ROUND(IF(事前相談チェックシート!$U$4=mkrain!B$2,mkrain!B57,IF(事前相談チェックシート!$U$4=mkrain!C$2,mkrain!C57,IF(事前相談チェックシート!$U$4=mkrain!D$2,mkrain!D57,mkrain!E57))),1)","v":10.5}]
[null,10.9299,7.7689000000000004,10.8742,7.0438999999999998,55,{"$f":"ROUND(IF(事前相談チェックシート!$U$4=mkrain!B$2,mkrain!B58,IF(事前相談チェックシート!$U$4=mkrain!C$2,mkrain!C58,IF(事前相談チェックシート!$U$4=mkrain!D$2,mkrain!D58,mkrain!E58))),1)","v":10.9}]
[null,11.3962,8.0937000000000001,11.3376,7.3422000000000001,56,{"$f":"ROUND(IF(事前相談チェックシート!$U$4=mkrain!B$2,mkrain!B59,IF(事前相談チェックシート!$U$4=mkrain!C$2,mkrain!C59,IF(事前相談チェックシート!$U$4=mkrain!D$2,mkrain!D59,mkrain!E59))),1)","v":11.4}]
[null,11.914300000000001,8.4544999999999995,11.852399999999999,7.6737000000000002,57,{"$f":"ROUND(IF(事前相談チェックシート!$U$4=mkrain!B$2,mkrain!B60,IF(事前相談チェックシート!$U$4=mkrain!C$2,mkrain!C60,IF(事前相談チェックシート!$U$4=mkrain!D$2,mkrain!D60,mkrain!E60))),1)","v":11.9}]
[null,12.4937,8.8577999999999992,12.4283,8.0446000000000009,58,{"$f":"ROUND(IF(事前相談チェックシート!$U$4=mkrain!B$2,mkrain!B61,IF(事前相談チェックシート!$U$4=mkrain!C$2,mkrain!C61,IF(事前相談チェックシート!$U$4=mkrain!D$2,mkrain!D61,mkrain!E61))),1)","v":12.5}]
[null,13.1469,9.3124000000000002,13.077500000000001,8.4627999999999997,59,{"$f":"ROUND(IF(事前相談チェックシート!$U$4=mkrain!B$2,mkrain!B62,IF(事前相談チェックシート!$U$4=mkrain!C$2,mkrain!C62,IF(事前相談チェックシート!$U$4=mkrain!D$2,mkrain!D62,mkrain!E62))),1)","v":13.1}]
[null,13.889799999999999,9.8294999999999995,13.8162,8.9387000000000008,60,{"$f":"ROUND(IF(事前相談チェックシート!$U$4=mkrain!B$2,mkrain!B63,IF(事前相談チェックシート!$U$4=mkrain!C$2,mkrain!C63,IF(事前相談チェックシート!$U$4=mkrain!D$2,mkrain!D63,mkrain!E63))),1)","v":13.9}]
[null,14.743499999999999,10.4239,14.6653,9.4861000000000004,61,{"$f":"ROUND(IF(事前相談チェックシート!$U$4=mkrain!B$2,mkrain!B64,IF(事前相談チェックシート!$U$4=mkrain!C$2,mkrain!C64,IF(事前相談チェックシート!$U$4=mkrain!D$2,mkrain!D64,mkrain!E64))),1)","v":14.7}]
[null,15.736700000000001,11.1158,15.653600000000001,10.1236,62,{"$f":"ROUND(IF(事前相談チェックシート!$U$4=mkrain!B$2,mkrain!B65,IF(事前相談チェックシート!$U$4=mkrain!C$2,mkrain!C65,IF(事前相談チェックシート!$U$4=mkrain!D$2,mkrain!D65,mkrain!E65))),1)","v":15.7}]
[null,16.909099999999999,11.9335,16.820699999999999,10.8772,63,{"$f":"ROUND(IF(事前相談チェックシート!$U$4=mkrain!B$2,mkrain!B66,IF(事前相談チェックシート!$U$4=mkrain!C$2,mkrain!C66,IF(事前相談チェックシート!$U$4=mkrain!D$2,mkrain!D66,mkrain!E66))),1)","v":16.899999999999999}]
[null,18.317499999999999,12.9176,18.223800000000001,11.7844,64,{"$f":"ROUND(IF(事前相談チェックシート!$U$4=mkrain!B$2,mkrain!B67,IF(事前相談チェックシート!$U$4=mkrain!C$2,mkrain!C67,IF(事前相談チェックシート!$U$4=mkrain!D$2,mkrain!D67,mkrain!E67))),1)","v":18.3}]
[null,20.046700000000001,14.129300000000001,19.948,12.901199999999999,65,{"$f":"ROUND(IF(事前相談チェックシート!$U$4=mkrain!B$2,mkrain!B68,IF(事前相談チェックシート!$U$4=mkrain!C$2,mkrain!C68,IF(事前相談チェックシート!$U$4=mkrain!D$2,mkrain!D68,mkrain!E68))),1)","v":20}]
[null,22.229099999999999,15.6655,22.126999999999999,14.3164,66,{"$f":"ROUND(IF(事前相談チェックシート!$U$4=mkrain!B$2,mkrain!B69,IF(事前相談チェックシート!$U$4=mkrain!C$2,mkrain!C69,IF(事前相談チェックシート!$U$4=mkrain!D$2,mkrain!D69,mkrain!E69))),1)","v":22.2}]
[null,25.085100000000001,17.690000000000001,24.983499999999999,16.178999999999998,67,{"$f":"ROUND(IF(事前相談チェックシート!$U$4=mkrain!B$2,mkrain!B70,IF(事前相談チェックシート!$U$4=mkrain!C$2,mkrain!C70,IF(事前相談チェックシート!$U$4=mkrain!D$2,mkrain!D70,mkrain!E70))),1)","v":25.1}]
[null,29.012899999999998,20.505800000000001,28.922000000000001,18.762599999999999,68,{"$f":"ROUND(IF(事前相談チェックシート!$U$4=mkrain!B$2,mkrain!B71,IF(事前相談チェックシート!$U$4=mkrain!C$2,mkrain!C71,IF(事前相談チェックシート!$U$4=mkrain!D$2,mkrain!D71,mkrain!E71))),1)","v":29}]
[null,34.82,24.7499,34.7682,22.634899999999998,69,{"$f":"ROUND(IF(事前相談チェックシート!$U$4=mkrain!B$2,mkrain!B72,IF(事前相談チェックシート!$U$4=mkrain!C$2,mkrain!C72,IF(事前相談チェックシート!$U$4=mkrain!D$2,mkrain!D72,mkrain!E72))),1)","v":34.799999999999997}]
[null,44.465800000000002,32.059399999999997,44.544400000000003,29.223600000000001,70,{"$f":"ROUND(IF(事前相談チェックシート!$U$4=mkrain!B$2,mkrain!B73,IF(事前相談チェックシート!$U$4=mkrain!C$2,mkrain!C73,IF(事前相談チェックシート!$U$4=mkrain!D$2,mkrain!D73,mkrain!E73))),1)","v":44.5}]
[null,64.504400000000004,48.560499999999998,65.132000000000005,43.628399999999999,71,{"$f":"ROUND(IF(事前相談チェックシート!$U$4=mkrain!B$2,mkrain!B74,IF(事前相談チェックシート!$U$4=mkrain!C$2,mkrain!C74,IF(事前相談チェックシート!$U$4=mkrain!D$2,mkrain!D74,mkrain!E74))),1)","v":64.5}]
[null,155.57599999999999,172.3177,164.08529999999999,127.002,72,{"$f":"ROUND(IF(事前相談チェックシート!$U$4=mkrain!B$2,mkrain!B75,IF(事前相談チェックシート!$U$4=mkrain!C$2,mkrain!C75,IF(事前相談チェックシート!$U$4=mkrain!D$2,mkrain!D75,mkrain!E75))),1)","v":155.6}]
[null,86.984200000000001,69.827200000000005,88.694000000000003,61.113900000000001,73,{"$f":"ROUND(IF(事前相談チェックシート!$U$4=mkrain!B$2,mkrain!B76,IF(事前相談チェックシート!$U$4=mkrain!C$2,mkrain!C76,IF(事前相談チェックシート!$U$4=mkrain!D$2,mkrain!D76,mkrain!E76))),1)","v":87}]
[null,52.301299999999998,38.279200000000003,52.548999999999999,34.7346,74,{"$f":"ROUND(IF(事前相談チェックシート!$U$4=mkrain!B$2,mkrain!B77,IF(事前相談チェックシート!$U$4=mkrain!C$2,mkrain!C77,IF(事前相談チェックシート!$U$4=mkrain!D$2,mkrain!D77,mkrain!E77))),1)","v":52.3}]
[null,38.9467,27.834099999999999,38.940399999999997,25.428599999999999,75,{"$f":"ROUND(IF(事前相談チェックシート!$U$4=mkrain!B$2,mkrain!B78,IF(事前相談チェックシート!$U$4=mkrain!C$2,mkrain!C78,IF(事前相談チェックシート!$U$4=mkrain!D$2,mkrain!D78,mkrain!E78))),1)","v":38.9}]
[null,31.602,22.385200000000001,31.524999999999999,20.480899999999998,76,{"$f":"ROUND(IF(事前相談チェックシート!$U$4=mkrain!B$2,mkrain!B79,IF(事前相談チェックシート!$U$4=mkrain!C$2,mkrain!C79,IF(事前相談チェックシート!$U$4=mkrain!D$2,mkrain!D79,mkrain!E79))),1)","v":31.6}]
[null,26.878699999999998,18.9709,26.7805,17.355399999999999,77,{"$f":"ROUND(IF(事前相談チェックシート!$U$4=mkrain!B$2,mkrain!B80,IF(事前相談チェックシート!$U$4=mkrain!C$2,mkrain!C80,IF(事前相談チェックシート!$U$4=mkrain!D$2,mkrain!D80,mkrain!E80))),1)","v":26.9}]
[null,23.553799999999999,16.6023,23.4512,15.178800000000001,78,{"$f":"ROUND(IF(事前相談チェックシート!$U$4=mkrain!B$2,mkrain!B81,IF(事前相談チェックシート!$U$4=mkrain!C$2,mkrain!C81,IF(事前相談チェックシート!$U$4=mkrain!D$2,mkrain!D81,mkrain!E81))),1)","v":23.6}]
[null,21.0702,14.848699999999999,20.9695,13.5641,79,{"$f":"ROUND(IF(事前相談チェックシート!$U$4=mkrain!B$2,mkrain!B82,IF(事前相談チェックシート!$U$4=mkrain!C$2,mkrain!C82,IF(事前相談チェックシート!$U$4=mkrain!D$2,mkrain!D82,mkrain!E82))),1)","v":21.1}]
[null,19.135100000000001,13.49,19.038900000000002,12.311999999999999,80,{"$f":"ROUND(IF(事前相談チェックシート!$U$4=mkrain!B$2,mkrain!B83,IF(事前相談チェックシート!$U$4=mkrain!C$2,mkrain!C83,IF(事前相談チェックシート!$U$4=mkrain!D$2,mkrain!D83,mkrain!E83))),1)","v":19.100000000000001}]
[null,17.5793,12.4015,17.488299999999999,11.3086,81,{"$f":"ROUND(IF(事前相談チェックシート!$U$4=mkrain!B$2,mkrain!B84,IF(事前相談チェックシート!$U$4=mkrain!C$2,mkrain!C84,IF(事前相談チェックシート!$U$4=mkrain!D$2,mkrain!D84,mkrain!E84))),1)","v":17.600000000000001}]
[null,16.297499999999999,11.5067,16.2117,10.4839,82,{"$f":"ROUND(IF(事前相談チェックシート!$U$4=mkrain!B$2,mkrain!B85,IF(事前相談チェックシート!$U$4=mkrain!C$2,mkrain!C85,IF(事前相談チェックシート!$U$4=mkrain!D$2,mkrain!D85,mkrain!E85))),1)","v":16.3}]
[null,15.220499999999999,10.7561,15.139900000000001,9.7921999999999993,83,{"$f":"ROUND(IF(事前相談チェックシート!$U$4=mkrain!B$2,mkrain!B86,IF(事前相談チェックシート!$U$4=mkrain!C$2,mkrain!C86,IF(事前相談チェックシート!$U$4=mkrain!D$2,mkrain!D86,mkrain!E86))),1)","v":15.2}]
[null,14.3012,10.1159,14.2254,9.2025000000000006,84,{"$f":"ROUND(IF(事前相談チェックシート!$U$4=mkrain!B$2,mkrain!B87,IF(事前相談チェックシート!$U$4=mkrain!C$2,mkrain!C87,IF(事前相談チェックシート!$U$4=mkrain!D$2,mkrain!D87,mkrain!E87))),1)","v":14.3}]
[null,13.5059,9.5623000000000005,13.4345,8.6928000000000001,85,{"$f":"ROUND(IF(事前相談チェックシート!$U$4=mkrain!B$2,mkrain!B88,IF(事前相談チェックシート!$U$4=mkrain!C$2,mkrain!C88,IF(事前相談チェックシート!$U$4=mkrain!D$2,mkrain!D88,mkrain!E88))),1)","v":13.5}]
[null,12.8102,9.0780999999999992,12.742800000000001,8.2471999999999994,86,{"$f":"ROUND(IF(事前相談チェックシート!$U$4=mkrain!B$2,mkrain!B89,IF(事前相談チェックシート!$U$4=mkrain!C$2,mkrain!C89,IF(事前相談チェックシート!$U$4=mkrain!D$2,mkrain!D89,mkrain!E89))),1)","v":12.8}]
[null,12.195600000000001,8.6502999999999997,12.132,7.8537999999999997,87,{"$f":"ROUND(IF(事前相談チェックシート!$U$4=mkrain!B$2,mkrain!B90,IF(事前相談チェックシート!$U$4=mkrain!C$2,mkrain!C90,IF(事前相談チェックシート!$U$4=mkrain!D$2,mkrain!D90,mkrain!E90))),1)","v":12.2}]
[null,11.648199999999999,8.2691999999999997,11.587999999999999,7.5034999999999998,88,{"$f":"ROUND(IF(事前相談チェックシート!$U$4=mkrain!B$2,mkrain!B91,IF(事前相談チェックシート!$U$4=mkrain!C$2,mkrain!C91,IF(事前相談チェックシート!$U$4=mkrain!D$2,mkrain!D91,mkrain!E91))),1)","v":11.6}]
[null,11.1571,7.9272,11.1,7.1891999999999996,89,{"$f":"ROUND(IF(事前相談チェックシート!$U$4=mkrain!B$2,mkrain!B92,IF(事前相談チェックシート!$U$4=mkrain!C$2,mkrain!C92,IF(事前相談チェックシート!$U$4=mkrain!D$2,mkrain!D92,mkrain!E92))),1)","v":11.2}]
[null,10.7136,7.6181999999999999,10.6593,6.9055,90,{"$f":"ROUND(IF(事前相談チェックシート!$U$4=mkrain!B$2,mkrain!B93,IF(事前相談チェックシート!$U$4=mkrain!C$2,mkrain!C93,IF(事前相談チェックシート!$U$4=mkrain!D$2,mkrain!D93,mkrain!E93))),1)","v":10.7}]
[null,10.3108,7.3375000000000004,10.2592,6.6478999999999999,91,{"$f":"ROUND(IF(事前相談チェックシート!$U$4=mkrain!B$2,mkrain!B94,IF(事前相談チェックシート!$U$4=mkrain!C$2,mkrain!C94,IF(事前相談チェックシート!$U$4=mkrain!D$2,mkrain!D94,mkrain!E94))),1)","v":10.3}]
[null,9.9430999999999994,7.0810000000000004,9.8939000000000004,6.4127000000000001,92,{"$f":"ROUND(IF(事前相談チェックシート!$U$4=mkrain!B$2,mkrain!B95,IF(事前相談チェックシート!$U$4=mkrain!C$2,mkrain!C95,IF(事前相談チェックシート!$U$4=mkrain!D$2,mkrain!D95,mkrain!E95))),1)","v":9.9}]
[null,9.6059000000000001,6.8457999999999997,9.5588999999999995,6.1970000000000001,93,{"$f":"ROUND(IF(事前相談チェックシート!$U$4=mkrain!B$2,mkrain!B96,IF(事前相談チェックシート!$U$4=mkrain!C$2,mkrain!C96,IF(事前相談チェックシート!$U$4=mkrain!D$2,mkrain!D96,mkrain!E96))),1)","v":9.6}]
[null,9.2954000000000008,6.6289999999999996,9.2504000000000008,5.9983000000000004,94,{"$f":"ROUND(IF(事前相談チェックシート!$U$4=mkrain!B$2,mkrain!B97,IF(事前相談チェックシート!$U$4=mkrain!C$2,mkrain!C97,IF(事前相談チェックシート!$U$4=mkrain!D$2,mkrain!D97,mkrain!E97))),1)","v":9.3000000000000007}]
[null,9.0083000000000002,6.4284999999999997,8.9652999999999992,5.8147000000000002,95,{"$f":"ROUND(IF(事前相談チェックシート!$U$4=mkrain!B$2,mkrain!B98,IF(事前相談チェックシート!$U$4=mkrain!C$2,mkrain!C98,IF(事前相談チェックシート!$U$4=mkrain!D$2,mkrain!D98,mkrain!E98))),1)","v":9}]
[null,8.7420000000000009,6.2423000000000002,8.7007999999999992,5.6443000000000003,96,{"$f":"ROUND(IF(事前相談チェックシート!$U$4=mkrain!B$2,mkrain!B99,IF(事前相談チェックシート!$U$4=mkrain!C$2,mkrain!C99,IF(事前相談チェックシート!$U$4=mkrain!D$2,mkrain!D99,mkrain!E99))),1)","v":8.6999999999999993}]
[null,8.4943000000000008,6.0690999999999997,8.4547000000000008,5.4856999999999996,97,{"$f":"ROUND(IF(事前相談チェックシート!$U$4=mkrain!B$2,mkrain!B100,IF(事前相談チェックシート!$U$4=mkrain!C$2,mkrain!C100,IF(事前相談チェックシート!$U$4=mkrain!D$2,mkrain!D100,mkrain!E100))),1)","v":8.5}]
[null,8.2629999999999999,5.9073000000000002,8.2249999999999996,5.3376999999999999,98,{"$f":"ROUND(IF(事前相談チェックシート!$U$4=mkrain!B$2,mkrain!B101,IF(事前相談チェックシート!$U$4=mkrain!C$2,mkrain!C101,IF(事前相談チェックシート!$U$4=mkrain!D$2,mkrain!D101,mkrain!E101))),1)","v":8.3000000000000007}]
[null,8.0466999999999995,5.7557999999999998,8.01,5.1992000000000003,99,{"$f":"ROUND(IF(事前相談チェックシート!$U$4=mkrain!B$2,mkrain!B102,IF(事前相談チェックシート!$U$4=mkrain!C$2,mkrain!C102,IF(事前相談チェックシート!$U$4=mkrain!D$2,mkrain!D102,mkrain!E102))),1)","v":8}]
[null,7.8437000000000001,5.6135999999999999,7.8083999999999998,5.0693000000000001,100,{"$f":"ROUND(IF(事前相談チェックシート!$U$4=mkrain!B$2,mkrain!B103,IF(事前相談チェックシート!$U$4=mkrain!C$2,mkrain!C103,IF(事前相談チェックシート!$U$4=mkrain!D$2,mkrain!D103,mkrain!E103))),1)","v":7.8}]
[null,7.6528,5.4798,7.6188000000000002,4.9470999999999998,101,{"$f":"ROUND(IF(事前相談チェックシート!$U$4=mkrain!B$2,mkrain!B104,IF(事前相談チェックシート!$U$4=mkrain!C$2,mkrain!C104,IF(事前相談チェックシート!$U$4=mkrain!D$2,mkrain!D104,mkrain!E104))),1)","v":7.7}]
[null,7.4729999999999999,5.3536999999999999,7.4401999999999999,4.8319000000000001,102,{"$f":"ROUND(IF(事前相談チェックシート!$U$4=mkrain!B$2,mkrain!B105,IF(事前相談チェックシート!$U$4=mkrain!C$2,mkrain!C105,IF(事前相談チェックシート!$U$4=mkrain!D$2,mkrain!D105,mkrain!E105))),1)","v":7.5}]
[null,7.3032000000000004,5.2344999999999997,7.2714999999999996,4.7230999999999996,103,{"$f":"ROUND(IF(事前相談チェックシート!$U$4=mkrain!B$2,mkrain!B106,IF(事前相談チェックシート!$U$4=mkrain!C$2,mkrain!C106,IF(事前相談チェックシート!$U$4=mkrain!D$2,mkrain!D106,mkrain!E106))),1)","v":7.3}]
[null,7.1425999999999998,5.1218000000000004,7.1119000000000003,4.6201999999999996,104,{"$f":"ROUND(IF(事前相談チェックシート!$U$4=mkrain!B$2,mkrain!B107,IF(事前相談チェックシート!$U$4=mkrain!C$2,mkrain!C107,IF(事前相談チェックシート!$U$4=mkrain!D$2,mkrain!D107,mkrain!E107))),1)","v":7.1}]
[null,6.9904000000000002,5.0148999999999999,6.9607000000000001,4.5227000000000004,105,{"$f":"ROUND(IF(事前相談チェックシート!$U$4=mkrain!B$2,mkrain!B108,IF(事前相談チェックシート!$U$4=mkrain!C$2,mkrain!C108,IF(事前相談チェックシート!$U$4=mkrain!D$2,mkrain!D108,mkrain!E108))),1)","v":7}]
[null,6.8460000000000001,4.9132999999999996,6.8171999999999997,4.4301000000000004,106,{"$f":"ROUND(IF(事前相談チェックシート!$U$4=mkrain!B$2,mkrain!B109,IF(事前相談チェックシート!$U$4=mkrain!C$2,mkrain!C109,IF(事前相談チェックシート!$U$4=mkrain!D$2,mkrain!D109,mkrain!E109))),1)","v":6.8}]
[null,6.7085999999999997,4.8167999999999997,6.6807999999999996,4.3421000000000003,107,{"$f":"ROUND(IF(事前相談チェックシート!$U$4=mkrain!B$2,mkrain!B110,IF(事前相談チェックシート!$U$4=mkrain!C$2,mkrain!C110,IF(事前相談チェックシート!$U$4=mkrain!D$2,mkrain!D110,mkrain!E110))),1)","v":6.7}]
[null,6.5778999999999996,4.7248000000000001,6.5509000000000004,4.2583000000000002,108,{"$f":"ROUND(IF(事前相談チェックシート!$U$4=mkrain!B$2,mkrain!B111,IF(事前相談チェックシート!$U$4=mkrain!C$2,mkrain!C111,IF(事前相談チェックシート!$U$4=mkrain!D$2,mkrain!D111,mkrain!E111))),1)","v":6.6}]
[null,6.4532999999999996,4.6369999999999996,6.4269999999999996,4.1783000000000001,109,{"$f":"ROUND(IF(事前相談チェックシート!$U$4=mkrain!B$2,mkrain!B112,IF(事前相談チェックシート!$U$4=mkrain!C$2,mkrain!C112,IF(事前相談チェックシート!$U$4=mkrain!D$2,mkrain!D112,mkrain!E112))),1)","v":6.5}]
[null,6.3342999999999998,4.5532000000000004,6.3087999999999997,4.1020000000000003,110,{"$f":"ROUND(IF(事前相談チェックシート!$U$4=mkrain!B$2,mkrain!B113,IF(事前相談チェックシート!$U$4=mkrain!C$2,mkrain!C113,IF(事前相談チェックシート!$U$4=mkrain!D$2,mkrain!D113,mkrain!E113))),1)","v":6.3}]
[null,6.2206000000000001,4.4730999999999996,6.1958000000000002,4.0290999999999997,111,{"$f":"ROUND(IF(事前相談チェックシート!$U$4=mkrain!B$2,mkrain!B114,IF(事前相談チェックシート!$U$4=mkrain!C$2,mkrain!C114,IF(事前相談チェックシート!$U$4=mkrain!D$2,mkrain!D114,mkrain!E114))),1)","v":6.2}]
[null,6.1117999999999997,4.3963999999999999,6.0876999999999999,3.9592000000000001,112,{"$f":"ROUND(IF(事前相談チェックシート!$U$4=mkrain!B$2,mkrain!B115,IF(事前相談チェックシート!$U$4=mkrain!C$2,mkrain!C115,IF(事前相談チェックシート!$U$4=mkrain!D$2,mkrain!D115,mkrain!E115))),1)","v":6.1}]
[null,6.0075000000000003,4.3228999999999997,5.9840999999999998,3.8923000000000001,113,{"$f":"ROUND(IF(事前相談チェックシート!$U$4=mkrain!B$2,mkrain!B116,IF(事前相談チェックシート!$U$4=mkrain!C$2,mkrain!C116,IF(事前相談チェックシート!$U$4=mkrain!D$2,mkrain!D116,mkrain!E116))),1)","v":6}]
[null,5.9076000000000004,4.2523999999999997,5.8848000000000003,3.8281999999999998,114,{"$f":"ROUND(IF(事前相談チェックシート!$U$4=mkrain!B$2,mkrain!B117,IF(事前相談チェックシート!$U$4=mkrain!C$2,mkrain!C117,IF(事前相談チェックシート!$U$4=mkrain!D$2,mkrain!D117,mkrain!E117))),1)","v":5.9}]
[null,5.8116000000000003,4.1845999999999997,5.7893999999999997,3.7665999999999999,115,{"$f":"ROUND(IF(事前相談チェックシート!$U$4=mkrain!B$2,mkrain!B118,IF(事前相談チェックシート!$U$4=mkrain!C$2,mkrain!C118,IF(事前相談チェックシート!$U$4=mkrain!D$2,mkrain!D118,mkrain!E118))),1)","v":5.8}]
[null,5.7194000000000003,4.1195000000000004,5.6978,3.7073999999999998,116,{"$f":"ROUND(IF(事前相談チェックシート!$U$4=mkrain!B$2,mkrain!B119,IF(事前相談チェックシート!$U$4=mkrain!C$2,mkrain!C119,IF(事前相談チェックシート!$U$4=mkrain!D$2,mkrain!D119,mkrain!E119))),1)","v":5.7}]
[null,5.6307999999999998,4.0568999999999997,5.6096000000000004,3.6503999999999999,117,{"$f":"ROUND(IF(事前相談チェックシート!$U$4=mkrain!B$2,mkrain!B120,IF(事前相談チェックシート!$U$4=mkrain!C$2,mkrain!C120,IF(事前相談チェックシート!$U$4=mkrain!D$2,mkrain!D120,mkrain!E120))),1)","v":5.6}]
[null,5.5453999999999999,3.9965999999999999,5.5247999999999999,3.5956000000000001,118,{"$f":"ROUND(IF(事前相談チェックシート!$U$4=mkrain!B$2,mkrain!B121,IF(事前相談チェックシート!$U$4=mkrain!C$2,mkrain!C121,IF(事前相談チェックシート!$U$4=mkrain!D$2,mkrain!D121,mkrain!E121))),1)","v":5.5}]
[null,5.4631999999999996,3.9384000000000001,5.4431000000000003,3.5428000000000002,119,{"$f":"ROUND(IF(事前相談チェックシート!$U$4=mkrain!B$2,mkrain!B122,IF(事前相談チェックシート!$U$4=mkrain!C$2,mkrain!C122,IF(事前相談チェックシート!$U$4=mkrain!D$2,mkrain!D122,mkrain!E122))),1)","v":5.5}]
[null,5.3838999999999997,3.8822999999999999,5.3642000000000003,3.4918,120,{"$f":"ROUND(IF(事前相談チェックシート!$U$4=mkrain!B$2,mkrain!B123,IF(事前相談チェックシート!$U$4=mkrain!C$2,mkrain!C123,IF(事前相談チェックシート!$U$4=mkrain!D$2,mkrain!D123,mkrain!E123))),1)","v":5.4}]
[null,5.3074000000000003,3.8281999999999998,5.2881999999999998,3.4426000000000001,121,{"$f":"ROUND(IF(事前相談チェックシート!$U$4=mkrain!B$2,mkrain!B124,IF(事前相談チェックシート!$U$4=mkrain!C$2,mkrain!C124,IF(事前相談チェックシート!$U$4=mkrain!D$2,mkrain!D124,mkrain!E124))),1)","v":5.3}]
[null,5.2335000000000003,3.7759,5.2148000000000003,3.3952,122,{"$f":"ROUND(IF(事前相談チェックシート!$U$4=mkrain!B$2,mkrain!B125,IF(事前相談チェックシート!$U$4=mkrain!C$2,mkrain!C125,IF(事前相談チェックシート!$U$4=mkrain!D$2,mkrain!D125,mkrain!E125))),1)","v":5.2}]
[null,5.1620999999999997,3.7254,5.1437999999999997,3.3492999999999999,123,{"$f":"ROUND(IF(事前相談チェックシート!$U$4=mkrain!B$2,mkrain!B126,IF(事前相談チェックシート!$U$4=mkrain!C$2,mkrain!C126,IF(事前相談チェックシート!$U$4=mkrain!D$2,mkrain!D126,mkrain!E126))),1)","v":5.2}]
[null,5.0930999999999997,3.6764999999999999,5.0751999999999997,3.3048999999999999,124,{"$f":"ROUND(IF(事前相談チェックシート!$U$4=mkrain!B$2,mkrain!B127,IF(事前相談チェックシート!$U$4=mkrain!C$2,mkrain!C127,IF(事前相談チェックシート!$U$4=mkrain!D$2,mkrain!D127,mkrain!E127))),1)","v":5.0999999999999996}]
[null,5.0263,3.6291000000000002,5.0087999999999999,3.2618999999999998,125,{"$f":"ROUND(IF(事前相談チェックシート!$U$4=mkrain!B$2,mkrain!B128,IF(事前相談チェックシート!$U$4=mkrain!C$2,mkrain!C128,IF(事前相談チェックシート!$U$4=mkrain!D$2,mkrain!D128,mkrain!E128))),1)","v":5}]
[null,4.9617000000000004,3.5832999999999999,4.9444999999999997,3.2202999999999999,126,{"$f":"ROUND(IF(事前相談チェックシート!$U$4=mkrain!B$2,mkrain!B129,IF(事前相談チェックシート!$U$4=mkrain!C$2,mkrain!C129,IF(事前相談チェックシート!$U$4=mkrain!D$2,mkrain!D129,mkrain!E129))),1)","v":5}]
[null,4.899,3.5388999999999999,4.8822000000000001,3.18,127,{"$f":"ROUND(IF(事前相談チェックシート!$U$4=mkrain!B$2,mkrain!B130,IF(事前相談チェックシート!$U$4=mkrain!C$2,mkrain!C130,IF(事前相談チェックシート!$U$4=mkrain!D$2,mkrain!D130,mkrain!E130))),1)","v":4.9000000000000004}]
[null,4.8383000000000003,3.4958,4.8217999999999996,3.141,128,{"$f":"ROUND(IF(事前相談チェックシート!$U$4=mkrain!B$2,mkrain!B131,IF(事前相談チェックシート!$U$4=mkrain!C$2,mkrain!C131,IF(事前相談チェックシート!$U$4=mkrain!D$2,mkrain!D131,mkrain!E131))),1)","v":4.8}]
[null,4.7793999999999999,3.4540000000000002,4.7632000000000003,3.1031,129,{"$f":"ROUND(IF(事前相談チェックシート!$U$4=mkrain!B$2,mkrain!B132,IF(事前相談チェックシート!$U$4=mkrain!C$2,mkrain!C132,IF(事前相談チェックシート!$U$4=mkrain!D$2,mkrain!D132,mkrain!E132))),1)","v":4.8}]
[null,4.7222,3.4134000000000002,4.7064000000000004,3.0663,130,{"$f":"ROUND(IF(事前相談チェックシート!$U$4=mkrain!B$2,mkrain!B133,IF(事前相談チェックシート!$U$4=mkrain!C$2,mkrain!C133,IF(事前相談チェックシート!$U$4=mkrain!D$2,mkrain!D133,mkrain!E133))),1)","v":4.7}]
[null,4.6666999999999996,3.3740000000000001,4.6512000000000002,3.0306000000000002,131,{"$f":"ROUND(IF(事前相談チェックシート!$U$4=mkrain!B$2,mkrain!B134,IF(事前相談チェックシート!$U$4=mkrain!C$2,mkrain!C134,IF(事前相談チェックシート!$U$4=mkrain!D$2,mkrain!D134,mkrain!E134))),1)","v":4.7}]
[null,4.6128,3.3357000000000001,4.5975999999999999,2.9958,132,{"$f":"ROUND(IF(事前相談チェックシート!$U$4=mkrain!B$2,mkrain!B135,IF(事前相談チェックシート!$U$4=mkrain!C$2,mkrain!C135,IF(事前相談チェックシート!$U$4=mkrain!D$2,mkrain!D135,mkrain!E135))),1)","v":4.5999999999999996}]
[null,4.5603999999999996,3.2985000000000002,4.5454999999999997,2.9621,133,{"$f":"ROUND(IF(事前相談チェックシート!$U$4=mkrain!B$2,mkrain!B136,IF(事前相談チェックシート!$U$4=mkrain!C$2,mkrain!C136,IF(事前相談チェックシート!$U$4=mkrain!D$2,mkrain!D136,mkrain!E136))),1)","v":4.5999999999999996}]
[null,4.5095000000000001,3.2623000000000002,4.4947999999999997,2.9293,134,{"$f":"ROUND(IF(事前相談チェックシート!$U$4=mkrain!B$2,mkrain!B137,IF(事前相談チェックシート!$U$4=mkrain!C$2,mkrain!C137,IF(事前相談チェックシート!$U$4=mkrain!D$2,mkrain!D137,mkrain!E137))),1)","v":4.5}]
[null,4.4599000000000002,3.2271000000000001,4.4455,2.8974000000000002,135,{"$f":"ROUND(IF(事前相談チェックシート!$U$4=mkrain!B$2,mkrain!B138,IF(事前相談チェックシート!$U$4=mkrain!C$2,mkrain!C138,IF(事前相談チェックシート!$U$4=mkrain!D$2,mkrain!D138,mkrain!E138))),1)","v":4.5}]
[null,4.4116999999999997,3.1928000000000001,4.3975999999999997,2.8662999999999998,136,{"$f":"ROUND(IF(事前相談チェックシート!$U$4=mkrain!B$2,mkrain!B139,IF(事前相談チェックシート!$U$4=mkrain!C$2,mkrain!C139,IF(事前相談チェックシート!$U$4=mkrain!D$2,mkrain!D139,mkrain!E139))),1)","v":4.4000000000000004}]
[null,4.3647,3.1594000000000002,4.3507999999999996,2.8361000000000001,137,{"$f":"ROUND(IF(事前相談チェックシート!$U$4=mkrain!B$2,mkrain!B140,IF(事前相談チェックシート!$U$4=mkrain!C$2,mkrain!C140,IF(事前相談チェックシート!$U$4=mkrain!D$2,mkrain!D140,mkrain!E140))),1)","v":4.4000000000000004}]
[null,4.319,3.1267999999999998,4.3052999999999999,2.8066,138,{"$f":"ROUND(IF(事前相談チェックシート!$U$4=mkrain!B$2,mkrain!B141,IF(事前相談チェックシート!$U$4=mkrain!C$2,mkrain!C141,IF(事前相談チェックシート!$U$4=mkrain!D$2,mkrain!D141,mkrain!E141))),1)","v":4.3}]
[null,4.2744,3.0951,4.2610000000000001,2.7778999999999998,139,{"$f":"ROUND(IF(事前相談チェックシート!$U$4=mkrain!B$2,mkrain!B142,IF(事前相談チェックシート!$U$4=mkrain!C$2,mkrain!C142,IF(事前相談チェックシート!$U$4=mkrain!D$2,mkrain!D142,mkrain!E142))),1)","v":4.3}]
[null,4.2309000000000001,3.0642,4.2178000000000004,2.7498999999999998,140,{"$f":"ROUND(IF(事前相談チェックシート!$U$4=mkrain!B$2,mkrain!B143,IF(事前相談チェックシート!$U$4=mkrain!C$2,mkrain!C143,IF(事前相談チェックシート!$U$4=mkrain!D$2,mkrain!D143,mkrain!E143))),1)","v":4.2}]
[null,4.1885000000000003,3.0339999999999998,4.1756000000000002,2.7225000000000001,141,{"$f":"ROUND(IF(事前相談チェックシート!$U$4=mkrain!B$2,mkrain!B144,IF(事前相談チェックシート!$U$4=mkrain!C$2,mkrain!C144,IF(事前相談チェックシート!$U$4=mkrain!D$2,mkrain!D144,mkrain!E144))),1)","v":4.2}]
[null,4.1471999999999998,3.0045000000000002,4.1345000000000001,2.6959,142,{"$f":"ROUND(IF(事前相談チェックシート!$U$4=mkrain!B$2,mkrain!B145,IF(事前相談チェックシート!$U$4=mkrain!C$2,mkrain!C145,IF(事前相談チェックシート!$U$4=mkrain!D$2,mkrain!D145,mkrain!E145))),1)","v":4.0999999999999996}]
[null,4.1069000000000004,2.9758,4.0944000000000003,2.6699000000000002,143,{"$f":"ROUND(IF(事前相談チェックシート!$U$4=mkrain!B$2,mkrain!B146,IF(事前相談チェックシート!$U$4=mkrain!C$2,mkrain!C146,IF(事前相談チェックシート!$U$4=mkrain!D$2,mkrain!D146,mkrain!E146))),1)","v":4.0999999999999996}]
[null,4.0674999999999999,2.9477000000000002,4.0552000000000001,2.6444999999999999,144,{"$f":"ROUND(IF(事前相談チェックシート!$U$4=mkrain!B$2,mkrain!B147,IF(事前相談チェックシート!$U$4=mkrain!C$2,mkrain!C147,IF(事前相談チェックシート!$U$4=mkrain!D$2,mkrain!D147,mkrain!E147))),1)","v":4.0999999999999996}]

{"sheet":"runoff","index":23,"n_rows":148,"n_cols":3,"rows_kept":148,"cut":false,"hidden":true,"merged":[]}
[null,{"$f":"MAX(B4:B148)","v":0.47543999999999997},{"$f":"MAX(C4:C148)","v":0.77800000000000002}]
[null,"行為前","行為後"]
[null,"流出量","流出量"]
["00:00:00",0,0]
["00:10:00",{"$f":"ROUND(1/360*事前相談チェックシート!$R$10*mkrain!$G4*事前相談チェックシート!$L$28,5)","v":1.2529999999999999E-2},{"$f":"ROUND(1/360*事前相談チェックシート!$R$12*mkrain!$G4*事前相談チェックシート!$M$28,5)","v":2.0500000000000001E-2}]
["00:20:00",{"$f":"ROUND(1/360*事前相談チェックシート!$R$10*mkrain!$G5*事前相談チェックシート!$L$28,5)","v":1.2529999999999999E-2},{"$f":"ROUND(1/360*事前相談チェックシート!$R$12*mkrain!$G5*事前相談チェックシート!$M$28,5)","v":2.0500000000000001E-2}]
["00:30:00",{"$f":"ROUND(1/360*事前相談チェックシート!$R$10*mkrain!$G6*事前相談チェックシート!$L$28,5)","v":1.2829999999999999E-2},{"$f":"ROUND(1/360*事前相談チェックシート!$R$12*mkrain!$G6*事前相談チェックシート!$M$28,5)","v":2.1000000000000001E-2}]
["00:40:00",{"$f":"ROUND(1/360*事前相談チェックシート!$R$10*mkrain!$G7*事前相談チェックシート!$L$28,5)","v":1.2829999999999999E-2},{"$f":"ROUND(1/360*事前相談チェックシート!$R$12*mkrain!$G7*事前相談チェックシート!$M$28,5)","v":2.1000000000000001E-2}]
["00:50:00",{"$f":"ROUND(1/360*事前相談チェックシート!$R$10*mkrain!$G8*事前相談チェックシート!$L$28,5)","v":1.3140000000000001E-2},{"$f":"ROUND(1/360*事前相談チェックシート!$R$12*mkrain!$G8*事前相談チェックシート!$M$28,5)","v":2.1499999999999998E-2}]
["01:00:00",{"$f":"ROUND(1/360*事前相談チェックシート!$R$10*mkrain!$G9*事前相談チェックシート!$L$28,5)","v":1.3140000000000001E-2},{"$f":"ROUND(1/360*事前相談チェックシート!$R$12*mkrain!$G9*事前相談チェックシート!$M$28,5)","v":2.1499999999999998E-2}]
["01:10:00",{"$f":"ROUND(1/360*事前相談チェックシート!$R$10*mkrain!$G10*事前相談チェックシート!$L$28,5)","v":1.3140000000000001E-2},{"$f":"ROUND(1/360*事前相談チェックシート!$R$12*mkrain!$G10*事前相談チェックシート!$M$28,5)","v":2.1499999999999998E-2}]
["01:20:00",{"$f":"ROUND(1/360*事前相談チェックシート!$R$10*mkrain!$G11*事前相談チェックシート!$L$28,5)","v":1.3440000000000001E-2},{"$f":"ROUND(1/360*事前相談チェックシート!$R$12*mkrain!$G11*事前相談チェックシート!$M$28,5)","v":2.1999999999999999E-2}]
["01:30:00",{"$f":"ROUND(1/360*事前相談チェックシート!$R$10*mkrain!$G12*事前相談チェックシート!$L$28,5)","v":1.3440000000000001E-2},{"$f":"ROUND(1/360*事前相談チェックシート!$R$12*mkrain!$G12*事前相談チェックシート!$M$28,5)","v":2.1999999999999999E-2}]
["01:40:00",{"$f":"ROUND(1/360*事前相談チェックシート!$R$10*mkrain!$G13*事前相談チェックシート!$L$28,5)","v":1.375E-2},{"$f":"ROUND(1/360*事前相談チェックシート!$R$12*mkrain!$G13*事前相談チェックシート!$M$28,5)","v":2.2499999999999999E-2}]
["01:50:00",{"$f":"ROUND(1/360*事前相談チェックシート!$R$10*mkrain!$G14*事前相談チェックシート!$L$28,5)","v":1.375E-2},{"$f":"ROUND(1/360*事前相談チェックシート!$R$12*mkrain!$G14*事前相談チェックシート!$M$28,5)","v":2.2499999999999999E-2}]
["02:00:00",{"$f":"ROUND(1/360*事前相談チェックシート!$R$10*mkrain!$G15*事前相談チェックシート!$L$28,5)","v":1.406E-2},{"$f":"ROUND(1/360*事前相談チェックシート!$R$12*mkrain!$G15*事前相談チェックシート!$M$28,5)","v":2.3E-2}]
["02:10:00",{"$f":"ROUND(1/360*事前相談チェックシート!$R$10*mkrain!$G16*事前相談チェックシート!$L$28,5)","v":1.406E-2},{"$f":"ROUND(1/360*事前相談チェックシート!$R$12*mkrain!$G16*事前相談チェックシート!$M$28,5)","v":2.3E-2}]
["02:20:00",{"$f":"ROUND(1/360*事前相談チェックシート!$R$10*mkrain!$G17*事前相談チェックシート!$L$28,5)","v":1.436E-2},{"$f":"ROUND(1/360*事前相談チェックシート!$R$12*mkrain!$G17*事前相談チェックシート!$M$28,5)","v":2.35E-2}]
["02:30:00",{"$f":"ROUND(1/360*事前相談チェックシート!$R$10*mkrain!$G18*事前相談チェックシート!$L$28,5)","v":1.4670000000000001E-2},{"$f":"ROUND(1/360*事前相談チェックシート!$R$12*mkrain!$G18*事前相談チェックシート!$M$28,5)","v":2.4E-2}]
["02:40:00",{"$f":"ROUND(1/360*事前相談チェックシート!$R$10*mkrain!$G19*事前相談チェックシート!$L$28,5)","v":1.4670000000000001E-2},{"$f":"ROUND(1/360*事前相談チェックシート!$R$12*mkrain!$G19*事前相談チェックシート!$M$28,5)","v":2.4E-2}]
["02:50:00",{"$f":"ROUND(1/360*事前相談チェックシート!$R$10*mkrain!$G20*事前相談チェックシート!$L$28,5)","v":1.4970000000000001E-2},{"$f":"ROUND(1/360*事前相談チェックシート!$R$12*mkrain!$G20*事前相談チェックシート!$M$28,5)","v":2.4500000000000001E-2}]
["03:00:00",{"$f":"ROUND(1/360*事前相談チェックシート!$R$10*mkrain!$G21*事前相談チェックシート!$L$28,5)","v":1.4970000000000001E-2},{"$f":"ROUND(1/360*事前相談チェックシート!$R$12*mkrain!$G21*事前相談チェックシート!$M$28,5)","v":2.4500000000000001E-2}]
["03:10:00",{"$f":"ROUND(1/360*事前相談チェックシート!$R$10*mkrain!$G22*事前相談チェックシート!$L$28,5)","v":1.528E-2},{"$f":"ROUND(1/360*事前相談チェックシート!$R$12*mkrain!$G22*事前相談チェックシート!$M$28,5)","v":2.5000000000000001E-2}]
["03:20:00",{"$f":"ROUND(1/360*事前相談チェックシート!$R$10*mkrain!$G23*事前相談チェックシート!$L$28,5)","v":1.558E-2},{"$f":"ROUND(1/360*事前相談チェックシート!$R$12*mkrain!$G23*事前相談チェックシート!$M$28,5)","v":2.5499999999999998E-2}]
["03:30:00",{"$f":"ROUND(1/360*事前相談チェックシート!$R$10*mkrain!$G24*事前相談チェックシート!$L$28,5)","v":1.558E-2},{"$f":"ROUND(1/360*事前相談チェックシート!$R$12*mkrain!$G24*事前相談チェックシート!$M$28,5)","v":2.5499999999999998E-2}]
["03:40:00",{"$f":"ROUND(1/360*事前相談チェックシート!$R$10*mkrain!$G25*事前相談チェックシート!$L$28,5)","v":1.5890000000000001E-2},{"$f":"ROUND(1/360*事前相談チェックシート!$R$12*mkrain!$G25*事前相談チェックシート!$M$28,5)","v":2.5999999999999999E-2}]
["03:50:00",{"$f":"ROUND(1/360*事前相談チェックシート!$R$10*mkrain!$G26*事前相談チェックシート!$L$28,5)","v":1.619E-2},{"$f":"ROUND(1/360*事前相談チェックシート!$R$12*mkrain!$G26*事前相談チェックシート!$M$28,5)","v":2.6499999999999999E-2}]
["04:00:00",{"$f":"ROUND(1/360*事前相談チェックシート!$R$10*mkrain!$G27*事前相談チェックシート!$L$28,5)","v":1.619E-2},{"$f":"ROUND(1/360*事前相談チェックシート!$R$12*mkrain!$G27*事前相談チェックシート!$M$28,5)","v":2.6499999999999999E-2}]
["04:10:00",{"$f":"ROUND(1/360*事前相談チェックシート!$R$10*mkrain!$G28*事前相談チェックシート!$L$28,5)","v":1.6500000000000001E-2},{"$f":"ROUND(1/360*事前相談チェックシート!$R$12*mkrain!$G28*事前相談チェックシート!$M$28,5)","v":2.7E-2}]
["04:20:00",{"$f":"ROUND(1/360*事前相談チェックシート!$R$10*mkrain!$G29*事前相談チェックシート!$L$28,5)","v":1.6809999999999999E-2},{"$f":"ROUND(1/360*事前相談チェックシート!$R$12*mkrain!$G29*事前相談チェックシート!$M$28,5)","v":2.75E-2}]
["04:30:00",{"$f":"ROUND(1/360*事前相談チェックシート!$R$10*mkrain!$G30*事前相談チェックシート!$L$28,5)","v":1.711E-2},{"$f":"ROUND(1/360*事前相談チェックシート!$R$12*mkrain!$G30*事前相談チェックシート!$M$28,5)","v":2.8000000000000001E-2}]
["04:40:00",{"$f":"ROUND(1/360*事前相談チェックシート!$R$10*mkrain!$G31*事前相談チェックシート!$L$28,5)","v":1.7420000000000001E-2},{"$f":"ROUND(1/360*事前相談チェックシート!$R$12*mkrain!$G31*事前相談チェックシート!$M$28,5)","v":2.8500000000000001E-2}]
["04:50:00",{"$f":"ROUND(1/360*事前相談チェックシート!$R$10*mkrain!$G32*事前相談チェックシート!$L$28,5)","v":1.772E-2},{"$f":"ROUND(1/360*事前相談チェックシート!$R$12*mkrain!$G32*事前相談チェックシート!$M$28,5)","v":2.9000000000000001E-2}]
["05:00:00",{"$f":"ROUND(1/360*事前相談チェックシート!$R$10*mkrain!$G33*事前相談チェックシート!$L$28,5)","v":1.8030000000000001E-2},{"$f":"ROUND(1/360*事前相談チェックシート!$R$12*mkrain!$G33*事前相談チェックシート!$M$28,5)","v":2.9499999999999998E-2}]
["05:10:00",{"$f":"ROUND(1/360*事前相談チェックシート!$R$10*mkrain!$G34*事前相談チェックシート!$L$28,5)","v":1.8329999999999999E-2},{"$f":"ROUND(1/360*事前相談チェックシート!$R$12*mkrain!$G34*事前相談チェックシート!$M$28,5)","v":0.03}]
["05:20:00",{"$f":"ROUND(1/360*事前相談チェックシート!$R$10*mkrain!$G35*事前相談チェックシート!$L$28,5)","v":1.864E-2},{"$f":"ROUND(1/360*事前相談チェックシート!$R$12*mkrain!$G35*事前相談チェックシート!$M$28,5)","v":3.0499999999999999E-2}]
["05:30:00",{"$f":"ROUND(1/360*事前相談チェックシート!$R$10*mkrain!$G36*事前相談チェックシート!$L$28,5)","v":1.8939999999999999E-2},{"$f":"ROUND(1/360*事前相談チェックシート!$R$12*mkrain!$G36*事前相談チェックシート!$M$28,5)","v":3.1E-2}]
["05:40:00",{"$f":"ROUND(1/360*事前相談チェックシート!$R$10*mkrain!$G37*事前相談チェックシート!$L$28,5)","v":1.925E-2},{"$f":"ROUND(1/360*事前相談チェックシート!$R$12*mkrain!$G37*事前相談チェックシート!$M$28,5)","v":3.15E-2}]
["05:50:00",{"$f":"ROUND(1/360*事前相談チェックシート!$R$10*mkrain!$G38*事前相談チェックシート!$L$28,5)","v":1.9560000000000001E-2},{"$f":"ROUND(1/360*事前相談チェックシート!$R$12*mkrain!$G38*事前相談チェックシート!$M$28,5)","v":3.2000000000000001E-2}]
["06:00:00",{"$f":"ROUND(1/360*事前相談チェックシート!$R$10*mkrain!$G39*事前相談チェックシート!$L$28,5)","v":1.9859999999999999E-2},{"$f":"ROUND(1/360*事前相談チェックシート!$R$12*mkrain!$G39*事前相談チェックシート!$M$28,5)","v":3.2500000000000001E-2}]
["06:10:00",{"$f":"ROUND(1/360*事前相談チェックシート!$R$10*mkrain!$G40*事前相談チェックシート!$L$28,5)","v":2.017E-2},{"$f":"ROUND(1/360*事前相談チェックシート!$R$12*mkrain!$G40*事前相談チェックシート!$M$28,5)","v":3.3000000000000002E-2}]
["06:20:00",{"$f":"ROUND(1/360*事前相談チェックシート!$R$10*mkrain!$G41*事前相談チェックシート!$L$28,5)","v":2.078E-2},{"$f":"ROUND(1/360*事前相談チェックシート!$R$12*mkrain!$G41*事前相談チェックシート!$M$28,5)","v":3.4000000000000002E-2}]
["06:30:00",{"$f":"ROUND(1/360*事前相談チェックシート!$R$10*mkrain!$G42*事前相談チェックシート!$L$28,5)","v":2.1080000000000002E-2},{"$f":"ROUND(1/360*事前相談チェックシート!$R$12*mkrain!$G42*事前相談チェックシート!$M$28,5)","v":3.4500000000000003E-2}]
["06:40:00",{"$f":"ROUND(1/360*事前相談チェックシート!$R$10*mkrain!$G43*事前相談チェックシート!$L$28,5)","v":2.1690000000000001E-2},{"$f":"ROUND(1/360*事前相談チェックシート!$R$12*mkrain!$G43*事前相談チェックシート!$M$28,5)","v":3.5499999999999997E-2}]
["06:50:00",{"$f":"ROUND(1/360*事前相談チェックシート!$R$10*mkrain!$G44*事前相談チェックシート!$L$28,5)","v":2.1999999999999999E-2},{"$f":"ROUND(1/360*事前相談チェックシート!$R$12*mkrain!$G44*事前相談チェックシート!$M$28,5)","v":3.5999999999999997E-2}]
["07:00:00",{"$f":"ROUND(1/360*事前相談チェックシート!$R$10*mkrain!$G45*事前相談チェックシート!$L$28,5)","v":2.2610000000000002E-2},{"$f":"ROUND(1/360*事前相談チェックシート!$R$12*mkrain!$G45*事前相談チェックシート!$M$28,5)","v":3.6999999999999998E-2}]
["07:10:00",{"$f":"ROUND(1/360*事前相談チェックシート!$R$10*mkrain!$G46*事前相談チェックシート!$L$28,5)","v":2.3220000000000001E-2},{"$f":"ROUND(1/360*事前相談チェックシート!$R$12*mkrain!$G46*事前相談チェックシート!$M$28,5)","v":3.7999999999999999E-2}]
["07:20:00",{"$f":"ROUND(1/360*事前相談チェックシート!$R$10*mkrain!$G47*事前相談チェックシート!$L$28,5)","v":2.3529999999999999E-2},{"$f":"ROUND(1/360*事前相談チェックシート!$R$12*mkrain!$G47*事前相談チェックシート!$M$28,5)","v":3.85E-2}]
["07:30:00",{"$f":"ROUND(1/360*事前相談チェックシート!$R$10*mkrain!$G48*事前相談チェックシート!$L$28,5)","v":2.4140000000000002E-2},{"$f":"ROUND(1/360*事前相談チェックシート!$R$12*mkrain!$G48*事前相談チェックシート!$M$28,5)","v":3.95E-2}]
["07:40:00",{"$f":"ROUND(1/360*事前相談チェックシート!$R$10*mkrain!$G49*事前相談チェックシート!$L$28,5)","v":2.5059999999999999E-2},{"$f":"ROUND(1/360*事前相談チェックシート!$R$12*mkrain!$G49*事前相談チェックシート!$M$28,5)","v":4.1000000000000002E-2}]
["07:50:00",{"$f":"ROUND(1/360*事前相談チェックシート!$R$10*mkrain!$G50*事前相談チェックシート!$L$28,5)","v":2.5669999999999998E-2},{"$f":"ROUND(1/360*事前相談チェックシート!$R$12*mkrain!$G50*事前相談チェックシート!$M$28,5)","v":4.2000000000000003E-2}]
["08:00:00",{"$f":"ROUND(1/360*事前相談チェックシート!$R$10*mkrain!$G51*事前相談チェックシート!$L$28,5)","v":2.6280000000000001E-2},{"$f":"ROUND(1/360*事前相談チェックシート!$R$12*mkrain!$G51*事前相談チェックシート!$M$28,5)","v":4.2999999999999997E-2}]
["08:10:00",{"$f":"ROUND(1/360*事前相談チェックシート!$R$10*mkrain!$G52*事前相談チェックシート!$L$28,5)","v":2.7189999999999999E-2},{"$f":"ROUND(1/360*事前相談チェックシート!$R$12*mkrain!$G52*事前相談チェックシート!$M$28,5)","v":4.4499999999999998E-2}]
["08:20:00",{"$f":"ROUND(1/360*事前相談チェックシート!$R$10*mkrain!$G53*事前相談チェックシート!$L$28,5)","v":2.7810000000000001E-2},{"$f":"ROUND(1/360*事前相談チェックシート!$R$12*mkrain!$G53*事前相談チェックシート!$M$28,5)","v":4.5499999999999999E-2}]
["08:30:00",{"$f":"ROUND(1/360*事前相談チェックシート!$R$10*mkrain!$G54*事前相談チェックシート!$L$28,5)","v":2.8719999999999999E-2},{"$f":"ROUND(1/360*事前相談チェックシート!$R$12*mkrain!$G54*事前相談チェックシート!$M$28,5)","v":4.7E-2}]
["08:40:00",{"$f":"ROUND(1/360*事前相談チェックシート!$R$10*mkrain!$G55*事前相談チェックシート!$L$28,5)","v":2.9940000000000001E-2},{"$f":"ROUND(1/360*事前相談チェックシート!$R$12*mkrain!$G55*事前相談チェックシート!$M$28,5)","v":4.9000000000000002E-2}]
["08:50:00",{"$f":"ROUND(1/360*事前相談チェックシート!$R$10*mkrain!$G56*事前相談チェックシート!$L$28,5)","v":3.0859999999999999E-2},{"$f":"ROUND(1/360*事前相談チェックシート!$R$12*mkrain!$G56*事前相談チェックシート!$M$28,5)","v":5.0500000000000003E-2}]
["09:00:00",{"$f":"ROUND(1/360*事前相談チェックシート!$R$10*mkrain!$G57*事前相談チェックシート!$L$28,5)","v":3.2079999999999997E-2},{"$f":"ROUND(1/360*事前相談チェックシート!$R$12*mkrain!$G57*事前相談チェックシート!$M$28,5)","v":5.2499999999999998E-2}]
["09:10:00",{"$f":"ROUND(1/360*事前相談チェックシート!$R$10*mkrain!$G58*事前相談チェックシート!$L$28,5)","v":3.3309999999999999E-2},{"$f":"ROUND(1/360*事前相談チェックシート!$R$12*mkrain!$G58*事前相談チェックシート!$M$28,5)","v":5.45E-2}]
["09:20:00",{"$f":"ROUND(1/360*事前相談チェックシート!$R$10*mkrain!$G59*事前相談チェックシート!$L$28,5)","v":3.483E-2},{"$f":"ROUND(1/360*事前相談チェックシート!$R$12*mkrain!$G59*事前相談チェックシート!$M$28,5)","v":5.7000000000000002E-2}]
["09:30:00",{"$f":"ROUND(1/360*事前相談チェックシート!$R$10*mkrain!$G60*事前相談チェックシート!$L$28,5)","v":3.6360000000000003E-2},{"$f":"ROUND(1/360*事前相談チェックシート!$R$12*mkrain!$G60*事前相談チェックシート!$M$28,5)","v":5.9499999999999997E-2}]
["09:40:00",{"$f":"ROUND(1/360*事前相談チェックシート!$R$10*mkrain!$G61*事前相談チェックシート!$L$28,5)","v":3.8190000000000002E-2},{"$f":"ROUND(1/360*事前相談チェックシート!$R$12*mkrain!$G61*事前相談チェックシート!$M$28,5)","v":6.25E-2}]
["09:50:00",{"$f":"ROUND(1/360*事前相談チェックシート!$R$10*mkrain!$G62*事前相談チェックシート!$L$28,5)","v":4.0030000000000003E-2},{"$f":"ROUND(1/360*事前相談チェックシート!$R$12*mkrain!$G62*事前相談チェックシート!$M$28,5)","v":6.5500000000000003E-2}]
["10:00:00",{"$f":"ROUND(1/360*事前相談チェックシート!$R$10*mkrain!$G63*事前相談チェックシート!$L$28,5)","v":4.2470000000000001E-2},{"$f":"ROUND(1/360*事前相談チェックシート!$R$12*mkrain!$G63*事前相談チェックシート!$M$28,5)","v":6.9500000000000006E-2}]
["10:10:00",{"$f":"ROUND(1/360*事前相談チェックシート!$R$10*mkrain!$G64*事前相談チェックシート!$L$28,5)","v":4.4920000000000002E-2},{"$f":"ROUND(1/360*事前相談チェックシート!$R$12*mkrain!$G64*事前相談チェックシート!$M$28,5)","v":7.3499999999999996E-2}]
["10:20:00",{"$f":"ROUND(1/360*事前相談チェックシート!$R$10*mkrain!$G65*事前相談チェックシート!$L$28,5)","v":4.7969999999999999E-2},{"$f":"ROUND(1/360*事前相談チェックシート!$R$12*mkrain!$G65*事前相談チェックシート!$M$28,5)","v":7.85E-2}]
["10:30:00",{"$f":"ROUND(1/360*事前相談チェックシート!$R$10*mkrain!$G66*事前相談チェックシート!$L$28,5)","v":5.1639999999999998E-2},{"$f":"ROUND(1/360*事前相談チェックシート!$R$12*mkrain!$G66*事前相談チェックシート!$M$28,5)","v":8.4500000000000006E-2}]
["10:40:00",{"$f":"ROUND(1/360*事前相談チェックシート!$R$10*mkrain!$G67*事前相談チェックシート!$L$28,5)","v":5.5919999999999997E-2},{"$f":"ROUND(1/360*事前相談チェックシート!$R$12*mkrain!$G67*事前相談チェックシート!$M$28,5)","v":9.1499999999999998E-2}]
["10:50:00",{"$f":"ROUND(1/360*事前相談チェックシート!$R$10*mkrain!$G68*事前相談チェックシート!$L$28,5)","v":6.1109999999999998E-2},{"$f":"ROUND(1/360*事前相談チェックシート!$R$12*mkrain!$G68*事前相談チェックシート!$M$28,5)","v":0.1}]
["11:00:00",{"$f":"ROUND(1/360*事前相談チェックシート!$R$10*mkrain!$G69*事前相談チェックシート!$L$28,5)","v":6.7830000000000001E-2},{"$f":"ROUND(1/360*事前相談チェックシート!$R$12*mkrain!$G69*事前相談チェックシート!$M$28,5)","v":0.111}]
["11:10:00",{"$f":"ROUND(1/360*事前相談チェックシート!$R$10*mkrain!$G70*事前相談チェックシート!$L$28,5)","v":7.6689999999999994E-2},{"$f":"ROUND(1/360*事前相談チェックシート!$R$12*mkrain!$G70*事前相談チェックシート!$M$28,5)","v":0.1255}]
["11:20:00",{"$f":"ROUND(1/360*事前相談チェックシート!$R$10*mkrain!$G71*事前相談チェックシート!$L$28,5)","v":8.8609999999999994E-2},{"$f":"ROUND(1/360*事前相談チェックシート!$R$12*mkrain!$G71*事前相談チェックシート!$M$28,5)","v":0.14499999999999999}]
["11:30:00",{"$f":"ROUND(1/360*事前相談チェックシート!$R$10*mkrain!$G72*事前相談チェックシート!$L$28,5)","v":0.10632999999999999},{"$f":"ROUND(1/360*事前相談チェックシート!$R$12*mkrain!$G72*事前相談チェックシート!$M$28,5)","v":0.17399999999999999}]
["11:40:00",{"$f":"ROUND(1/360*事前相談チェックシート!$R$10*mkrain!$G73*事前相談チェックシート!$L$28,5)","v":0.13597000000000001},{"$f":"ROUND(1/360*事前相談チェックシート!$R$12*mkrain!$G73*事前相談チェックシート!$M$28,5)","v":0.2225}]
["11:50:00",{"$f":"ROUND(1/360*事前相談チェックシート!$R$10*mkrain!$G74*事前相談チェックシート!$L$28,5)","v":0.19708000000000001},{"$f":"ROUND(1/360*事前相談チェックシート!$R$12*mkrain!$G74*事前相談チェックシート!$M$28,5)","v":0.32250000000000001}]
["12:00:00",{"$f":"ROUND(1/360*事前相談チェックシート!$R$10*mkrain!$G75*事前相談チェックシート!$L$28,5)","v":0.47543999999999997},{"$f":"ROUND(1/360*事前相談チェックシート!$R$12*mkrain!$G75*事前相談チェックシート!$M$28,5)","v":0.77800000000000002}]
["12:10:00",{"$f":"ROUND(1/360*事前相談チェックシート!$R$10*mkrain!$G76*事前相談チェックシート!$L$28,5)","v":0.26583000000000001},{"$f":"ROUND(1/360*事前相談チェックシート!$R$12*mkrain!$G76*事前相談チェックシート!$M$28,5)","v":0.435}]
["12:20:00",{"$f":"ROUND(1/360*事前相談チェックシート!$R$10*mkrain!$G77*事前相談チェックシート!$L$28,5)","v":0.15981000000000001},{"$f":"ROUND(1/360*事前相談チェックシート!$R$12*mkrain!$G77*事前相談チェックシート!$M$28,5)","v":0.26150000000000001}]
["12:30:00",{"$f":"ROUND(1/360*事前相談チェックシート!$R$10*mkrain!$G78*事前相談チェックシート!$L$28,5)","v":0.11885999999999999},{"$f":"ROUND(1/360*事前相談チェックシート!$R$12*mkrain!$G78*事前相談チェックシート!$M$28,5)","v":0.19450000000000001}]
["12:40:00",{"$f":"ROUND(1/360*事前相談チェックシート!$R$10*mkrain!$G79*事前相談チェックシート!$L$28,5)","v":9.6560000000000007E-2},{"$f":"ROUND(1/360*事前相談チェックシート!$R$12*mkrain!$G79*事前相談チェックシート!$M$28,5)","v":0.158}]
["12:50:00",{"$f":"ROUND(1/360*事前相談チェックシート!$R$10*mkrain!$G80*事前相談チェックシート!$L$28,5)","v":8.2189999999999999E-2},{"$f":"ROUND(1/360*事前相談チェックシート!$R$12*mkrain!$G80*事前相談チェックシート!$M$28,5)","v":0.13450000000000001}]
["13:00:00",{"$f":"ROUND(1/360*事前相談チェックシート!$R$10*mkrain!$G81*事前相談チェックシート!$L$28,5)","v":7.2109999999999994E-2},{"$f":"ROUND(1/360*事前相談チェックシート!$R$12*mkrain!$G81*事前相談チェックシート!$M$28,5)","v":0.11799999999999999}]
["13:10:00",{"$f":"ROUND(1/360*事前相談チェックシート!$R$10*mkrain!$G82*事前相談チェックシート!$L$28,5)","v":6.447E-2},{"$f":"ROUND(1/360*事前相談チェックシート!$R$12*mkrain!$G82*事前相談チェックシート!$M$28,5)","v":0.1055}]
["13:20:00",{"$f":"ROUND(1/360*事前相談チェックシート!$R$10*mkrain!$G83*事前相談チェックシート!$L$28,5)","v":5.8360000000000002E-2},{"$f":"ROUND(1/360*事前相談チェックシート!$R$12*mkrain!$G83*事前相談チェックシート!$M$28,5)","v":9.5500000000000002E-2}]
["13:30:00",{"$f":"ROUND(1/360*事前相談チェックシート!$R$10*mkrain!$G84*事前相談チェックシート!$L$28,5)","v":5.3780000000000001E-2},{"$f":"ROUND(1/360*事前相談チェックシート!$R$12*mkrain!$G84*事前相談チェックシート!$M$28,5)","v":8.7999999999999995E-2}]
["13:40:00",{"$f":"ROUND(1/360*事前相談チェックシート!$R$10*mkrain!$G85*事前相談チェックシート!$L$28,5)","v":4.981E-2},{"$f":"ROUND(1/360*事前相談チェックシート!$R$12*mkrain!$G85*事前相談チェックシート!$M$28,5)","v":8.1500000000000003E-2}]
["13:50:00",{"$f":"ROUND(1/360*事前相談チェックシート!$R$10*mkrain!$G86*事前相談チェックシート!$L$28,5)","v":4.6440000000000002E-2},{"$f":"ROUND(1/360*事前相談チェックシート!$R$12*mkrain!$G86*事前相談チェックシート!$M$28,5)","v":7.5999999999999998E-2}]
["14:00:00",{"$f":"ROUND(1/360*事前相談チェックシート!$R$10*mkrain!$G87*事前相談チェックシート!$L$28,5)","v":4.369E-2},{"$f":"ROUND(1/360*事前相談チェックシート!$R$12*mkrain!$G87*事前相談チェックシート!$M$28,5)","v":7.1499999999999994E-2}]
["14:10:00",{"$f":"ROUND(1/360*事前相談チェックシート!$R$10*mkrain!$G88*事前相談チェックシート!$L$28,5)","v":4.1250000000000002E-2},{"$f":"ROUND(1/360*事前相談チェックシート!$R$12*mkrain!$G88*事前相談チェックシート!$M$28,5)","v":6.7500000000000004E-2}]
["14:20:00",{"$f":"ROUND(1/360*事前相談チェックシート!$R$10*mkrain!$G89*事前相談チェックシート!$L$28,5)","v":3.9109999999999999E-2},{"$f":"ROUND(1/360*事前相談チェックシート!$R$12*mkrain!$G89*事前相談チェックシート!$M$28,5)","v":6.4000000000000001E-2}]
["14:30:00",{"$f":"ROUND(1/360*事前相談チェックシート!$R$10*mkrain!$G90*事前相談チェックシート!$L$28,5)","v":3.7280000000000001E-2},{"$f":"ROUND(1/360*事前相談チェックシート!$R$12*mkrain!$G90*事前相談チェックシート!$M$28,5)","v":6.0999999999999999E-2}]
["14:40:00",{"$f":"ROUND(1/360*事前相談チェックシート!$R$10*mkrain!$G91*事前相談チェックシート!$L$28,5)","v":3.5439999999999999E-2},{"$f":"ROUND(1/360*事前相談チェックシート!$R$12*mkrain!$G91*事前相談チェックシート!$M$28,5)","v":5.8000000000000003E-2}]
["14:50:00",{"$f":"ROUND(1/360*事前相談チェックシート!$R$10*mkrain!$G92*事前相談チェックシート!$L$28,5)","v":3.422E-2},{"$f":"ROUND(1/360*事前相談チェックシート!$R$12*mkrain!$G92*事前相談チェックシート!$M$28,5)","v":5.6000000000000001E-2}]
["15:00:00",{"$f":"ROUND(1/360*事前相談チェックシート!$R$10*mkrain!$G93*事前相談チェックシート!$L$28,5)","v":3.2689999999999997E-2},{"$f":"ROUND(1/360*事前相談チェックシート!$R$12*mkrain!$G93*事前相談チェックシート!$M$28,5)","v":5.3499999999999999E-2}]
["15:10:00",{"$f":"ROUND(1/360*事前相談チェックシート!$R$10*mkrain!$G94*事前相談チェックシート!$L$28,5)","v":3.1469999999999998E-2},{"$f":"ROUND(1/360*事前相談チェックシート!$R$12*mkrain!$G94*事前相談チェックシート!$M$28,5)","v":5.1499999999999997E-2}]
["15:20:00",{"$f":"ROUND(1/360*事前相談チェックシート!$R$10*mkrain!$G95*事前相談チェックシート!$L$28,5)","v":3.0249999999999999E-2},{"$f":"ROUND(1/360*事前相談チェックシート!$R$12*mkrain!$G95*事前相談チェックシート!$M$28,5)","v":4.9500000000000002E-2}]
["15:30:00",{"$f":"ROUND(1/360*事前相談チェックシート!$R$10*mkrain!$G96*事前相談チェックシート!$L$28,5)","v":2.9329999999999998E-2},{"$f":"ROUND(1/360*事前相談チェックシート!$R$12*mkrain!$G96*事前相談チェックシート!$M$28,5)","v":4.8000000000000001E-2}]
["15:40:00",{"$f":"ROUND(1/360*事前相談チェックシート!$R$10*mkrain!$G97*事前相談チェックシート!$L$28,5)","v":2.8420000000000001E-2},{"$f":"ROUND(1/360*事前相談チェックシート!$R$12*mkrain!$G97*事前相談チェックシート!$M$28,5)","v":4.65E-2}]
["15:50:00",{"$f":"ROUND(1/360*事前相談チェックシート!$R$10*mkrain!$G98*事前相談チェックシート!$L$28,5)","v":2.75E-2},{"$f":"ROUND(1/360*事前相談チェックシート!$R$12*mkrain!$G98*事前相談チェックシート!$M$28,5)","v":4.4999999999999998E-2}]
["16:00:00",{"$f":"ROUND(1/360*事前相談チェックシート!$R$10*mkrain!$G99*事前相談チェックシート!$L$28,5)","v":2.6579999999999999E-2},{"$f":"ROUND(1/360*事前相談チェックシート!$R$12*mkrain!$G99*事前相談チェックシート!$M$28,5)","v":4.3499999999999997E-2}]
["16:10:00",{"$f":"ROUND(1/360*事前相談チェックシート!$R$10*mkrain!$G100*事前相談チェックシート!$L$28,5)","v":2.597E-2},{"$f":"ROUND(1/360*事前相談チェックシート!$R$12*mkrain!$G100*事前相談チェックシート!$M$28,5)","v":4.2500000000000003E-2}]
["16:20:00",{"$f":"ROUND(1/360*事前相談チェックシート!$R$10*mkrain!$G101*事前相談チェックシート!$L$28,5)","v":2.5360000000000001E-2},{"$f":"ROUND(1/360*事前相談チェックシート!$R$12*mkrain!$G101*事前相談チェックシート!$M$28,5)","v":4.1500000000000002E-2}]
["16:30:00",{"$f":"ROUND(1/360*事前相談チェックシート!$R$10*mkrain!$G102*事前相談チェックシート!$L$28,5)","v":2.444E-2},{"$f":"ROUND(1/360*事前相談チェックシート!$R$12*mkrain!$G102*事前相談チェックシート!$M$28,5)","v":0.04}]
["16:40:00",{"$f":"ROUND(1/360*事前相談チェックシート!$R$10*mkrain!$G103*事前相談チェックシート!$L$28,5)","v":2.383E-2},{"$f":"ROUND(1/360*事前相談チェックシート!$R$12*mkrain!$G103*事前相談チェックシート!$M$28,5)","v":3.9E-2}]
["16:50:00",{"$f":"ROUND(1/360*事前相談チェックシート!$R$10*mkrain!$G104*事前相談チェックシート!$L$28,5)","v":2.3529999999999999E-2},{"$f":"ROUND(1/360*事前相談チェックシート!$R$12*mkrain!$G104*事前相談チェックシート!$M$28,5)","v":3.85E-2}]
["17:00:00",{"$f":"ROUND(1/360*事前相談チェックシート!$R$10*mkrain!$G105*事前相談チェックシート!$L$28,5)","v":2.2919999999999999E-2},{"$f":"ROUND(1/360*事前相談チェックシート!$R$12*mkrain!$G105*事前相談チェックシート!$M$28,5)","v":3.7499999999999999E-2}]
["17:10:00",{"$f":"ROUND(1/360*事前相談チェックシート!$R$10*mkrain!$G106*事前相談チェックシート!$L$28,5)","v":2.231E-2},{"$f":"ROUND(1/360*事前相談チェックシート!$R$12*mkrain!$G106*事前相談チェックシート!$M$28,5)","v":3.6499999999999998E-2}]
["17:20:00",{"$f":"ROUND(1/360*事前相談チェックシート!$R$10*mkrain!$G107*事前相談チェックシート!$L$28,5)","v":2.1690000000000001E-2},{"$f":"ROUND(1/360*事前相談チェックシート!$R$12*mkrain!$G107*事前相談チェックシート!$M$28,5)","v":3.5499999999999997E-2}]
["17:30:00",{"$f":"ROUND(1/360*事前相談チェックシート!$R$10*mkrain!$G108*事前相談チェックシート!$L$28,5)","v":2.1389999999999999E-2},{"$f":"ROUND(1/360*事前相談チェックシート!$R$12*mkrain!$G108*事前相談チェックシート!$M$28,5)","v":3.5000000000000003E-2}]
["17:40:00",{"$f":"ROUND(1/360*事前相談チェックシート!$R$10*mkrain!$G109*事前相談チェックシート!$L$28,5)","v":2.078E-2},{"$f":"ROUND(1/360*事前相談チェックシート!$R$12*mkrain!$G109*事前相談チェックシート!$M$28,5)","v":3.4000000000000002E-2}]
["17:50:00",{"$f":"ROUND(1/360*事前相談チェックシート!$R$10*mkrain!$G110*事前相談チェックシート!$L$28,5)","v":2.0469999999999999E-2},{"$f":"ROUND(1/360*事前相談チェックシート!$R$12*mkrain!$G110*事前相談チェックシート!$M$28,5)","v":3.3500000000000002E-2}]
["18:00:00",{"$f":"ROUND(1/360*事前相談チェックシート!$R$10*mkrain!$G111*事前相談チェックシート!$L$28,5)","v":2.017E-2},{"$f":"ROUND(1/360*事前相談チェックシート!$R$12*mkrain!$G111*事前相談チェックシート!$M$28,5)","v":3.3000000000000002E-2}]
["18:10:00",{"$f":"ROUND(1/360*事前相談チェックシート!$R$10*mkrain!$G112*事前相談チェックシート!$L$28,5)","v":1.9859999999999999E-2},{"$f":"ROUND(1/360*事前相談チェックシート!$R$12*mkrain!$G112*事前相談チェックシート!$M$28,5)","v":3.2500000000000001E-2}]
["18:20:00",{"$f":"ROUND(1/360*事前相談チェックシート!$R$10*mkrain!$G113*事前相談チェックシート!$L$28,5)","v":1.925E-2},{"$f":"ROUND(1/360*事前相談チェックシート!$R$12*mkrain!$G113*事前相談チェックシート!$M$28,5)","v":3.15E-2}]
["18:30:00",{"$f":"ROUND(1/360*事前相談チェックシート!$R$10*mkrain!$G114*事前相談チェックシート!$L$28,5)","v":1.8939999999999999E-2},{"$f":"ROUND(1/360*事前相談チェックシート!$R$12*mkrain!$G114*事前相談チェックシート!$M$28,5)","v":3.1E-2}]
["18:40:00",{"$f":"ROUND(1/360*事前相談チェックシート!$R$10*mkrain!$G115*事前相談チェックシート!$L$28,5)","v":1.864E-2},{"$f":"ROUND(1/360*事前相談チェックシート!$R$12*mkrain!$G115*事前相談チェックシート!$M$28,5)","v":3.0499999999999999E-2}]
["18:50:00",{"$f":"ROUND(1/360*事前相談チェックシート!$R$10*mkrain!$G116*事前相談チェックシート!$L$28,5)","v":1.8329999999999999E-2},{"$f":"ROUND(1/360*事前相談チェックシート!$R$12*mkrain!$G116*事前相談チェックシート!$M$28,5)","v":0.03}]
["19:00:00",{"$f":"ROUND(1/360*事前相談チェックシート!$R$10*mkrain!$G117*事前相談チェックシート!$L$28,5)","v":1.8030000000000001E-2},{"$f":"ROUND(1/360*事前相談チェックシート!$R$12*mkrain!$G117*事前相談チェックシート!$M$28,5)","v":2.9499999999999998E-2}]
["19:10:00",{"$f":"ROUND(1/360*事前相談チェックシート!$R$10*mkrain!$G118*事前相談チェックシート!$L$28,5)","v":1.772E-2},{"$f":"ROUND(1/360*事前相談チェックシート!$R$12*mkrain!$G118*事前相談チェックシート!$M$28,5)","v":2.9000000000000001E-2}]
["19:20:00",{"$f":"ROUND(1/360*事前相談チェックシート!$R$10*mkrain!$G119*事前相談チェックシート!$L$28,5)","v":1.7420000000000001E-2},{"$f":"ROUND(1/360*事前相談チェックシート!$R$12*mkrain!$G119*事前相談チェックシート!$M$28,5)","v":2.8500000000000001E-2}]
["19:30:00",{"$f":"ROUND(1/360*事前相談チェックシート!$R$10*mkrain!$G120*事前相談チェックシート!$L$28,5)","v":1.711E-2},{"$f":"ROUND(1/360*事前相談チェックシート!$R$12*mkrain!$G120*事前相談チェックシート!$M$28,5)","v":2.8000000000000001E-2}]
["19:40:00",{"$f":"ROUND(1/360*事前相談チェックシート!$R$10*mkrain!$G121*事前相談チェックシート!$L$28,5)","v":1.6809999999999999E-2},{"$f":"ROUND(1/360*事前相談チェックシート!$R$12*mkrain!$G121*事前相談チェックシート!$M$28,5)","v":2.75E-2}]
["19:50:00",{"$f":"ROUND(1/360*事前相談チェックシート!$R$10*mkrain!$G122*事前相談チェックシート!$L$28,5)","v":1.6809999999999999E-2},{"$f":"ROUND(1/360*事前相談チェックシート!$R$12*mkrain!$G122*事前相談チェックシート!$M$28,5)","v":2.75E-2}]
["20:00:00",{"$f":"ROUND(1/360*事前相談チェックシート!$R$10*mkrain!$G123*事前相談チェックシート!$L$28,5)","v":1.6500000000000001E-2},{"$f":"ROUND(1/360*事前相談チェックシート!$R$12*mkrain!$G123*事前相談チェックシート!$M$28,5)","v":2.7E-2}]
["20:10:00",{"$f":"ROUND(1/360*事前相談チェックシート!$R$10*mkrain!$G124*事前相談チェックシート!$L$28,5)","v":1.619E-2},{"$f":"ROUND(1/360*事前相談チェックシート!$R$12*mkrain!$G124*事前相談チェックシート!$M$28,5)","v":2.6499999999999999E-2}]
["20:20:00",{"$f":"ROUND(1/360*事前相談チェックシート!$R$10*mkrain!$G125*事前相談チェックシート!$L$28,5)","v":1.5890000000000001E-2},{"$f":"ROUND(1/360*事前相談チェックシート!$R$12*mkrain!$G125*事前相談チェックシート!$M$28,5)","v":2.5999999999999999E-2}]
["20:30:00",{"$f":"ROUND(1/360*事前相談チェックシート!$R$10*mkrain!$G126*事前相談チェックシート!$L$28,5)","v":1.5890000000000001E-2},{"$f":"ROUND(1/360*事前相談チェックシート!$R$12*mkrain!$G126*事前相談チェックシート!$M$28,5)","v":2.5999999999999999E-2}]
["20:40:00",{"$f":"ROUND(1/360*事前相談チェックシート!$R$10*mkrain!$G127*事前相談チェックシート!$L$28,5)","v":1.558E-2},{"$f":"ROUND(1/360*事前相談チェックシート!$R$12*mkrain!$G127*事前相談チェックシート!$M$28,5)","v":2.5499999999999998E-2}]
["20:50:00",{"$f":"ROUND(1/360*事前相談チェックシート!$R$10*mkrain!$G128*事前相談チェックシート!$L$28,5)","v":1.528E-2},{"$f":"ROUND(1/360*事前相談チェックシート!$R$12*mkrain!$G128*事前相談チェックシート!$M$28,5)","v":2.5000000000000001E-2}]
["21:00:00",{"$f":"ROUND(1/360*事前相談チェックシート!$R$10*mkrain!$G129*事前相談チェックシート!$L$28,5)","v":1.528E-2},{"$f":"ROUND(1/360*事前相談チェックシート!$R$12*mkrain!$G129*事前相談チェックシート!$M$28,5)","v":2.5000000000000001E-2}]
["21:10:00",{"$f":"ROUND(1/360*事前相談チェックシート!$R$10*mkrain!$G130*事前相談チェックシート!$L$28,5)","v":1.4970000000000001E-2},{"$f":"ROUND(1/360*事前相談チェックシート!$R$12*mkrain!$G130*事前相談チェックシート!$M$28,5)","v":2.4500000000000001E-2}]
["21:20:00",{"$f":"ROUND(1/360*事前相談チェックシート!$R$10*mkrain!$G131*事前相談チェックシート!$L$28,5)","v":1.4670000000000001E-2},{"$f":"ROUND(1/360*事前相談チェックシート!$R$12*mkrain!$G131*事前相談チェックシート!$M$28,5)","v":2.4E-2}]
["21:30:00",{"$f":"ROUND(1/360*事前相談チェックシート!$R$10*mkrain!$G132*事前相談チェックシート!$L$28,5)","v":1.4670000000000001E-2},{"$f":"ROUND(1/360*事前相談チェックシート!$R$12*mkrain!$G132*事前相談チェックシート!$M$28,5)","v":2.4E-2}]
["21:40:00",{"$f":"ROUND(1/360*事前相談チェックシート!$R$10*mkrain!$G133*事前相談チェックシート!$L$28,5)","v":1.436E-2},{"$f":"ROUND(1/360*事前相談チェックシート!$R$12*mkrain!$G133*事前相談チェックシート!$M$28,5)","v":2.35E-2}]
["21:50:00",{"$f":"ROUND(1/360*事前相談チェックシート!$R$10*mkrain!$G134*事前相談チェックシート!$L$28,5)","v":1.436E-2},{"$f":"ROUND(1/360*事前相談チェックシート!$R$12*mkrain!$G134*事前相談チェックシート!$M$28,5)","v":2.35E-2}]
["22:00:00",{"$f":"ROUND(1/360*事前相談チェックシート!$R$10*mkrain!$G135*事前相談チェックシート!$L$28,5)","v":1.406E-2},{"$f":"ROUND(1/360*事前相談チェックシート!$R$12*mkrain!$G135*事前相談チェックシート!$M$28,5)","v":2.3E-2}]
["22:10:00",{"$f":"ROUND(1/360*事前相談チェックシート!$R$10*mkrain!$G136*事前相談チェックシート!$L$28,5)","v":1.406E-2},{"$f":"ROUND(1/360*事前相談チェックシート!$R$12*mkrain!$G136*事前相談チェックシート!$M$28,5)","v":2.3E-2}]
["22:20:00",{"$f":"ROUND(1/360*事前相談チェックシート!$R$10*mkrain!$G137*事前相談チェックシート!$L$28,5)","v":1.375E-2},{"$f":"ROUND(1/360*事前相談チェックシート!$R$12*mkrain!$G137*事前相談チェックシート!$M$28,5)","v":2.2499999999999999E-2}]
["22:30:00",{"$f":"ROUND(1/360*事前相談チェックシート!$R$10*mkrain!$G138*事前相談チェックシート!$L$28,5)","v":1.375E-2},{"$f":"ROUND(1/360*事前相談チェックシート!$R$12*mkrain!$G138*事前相談チェックシート!$M$28,5)","v":2.2499999999999999E-2}]
["22:40:00",{"$f":"ROUND(1/360*事前相談チェックシート!$R$10*mkrain!$G139*事前相談チェックシート!$L$28,5)","v":1.3440000000000001E-2},{"$f":"ROUND(1/360*事前相談チェックシート!$R$12*mkrain!$G139*事前相談チェックシート!$M$28,5)","v":2.1999999999999999E-2}]
["22:50:00",{"$f":"ROUND(1/360*事前相談チェックシート!$R$10*mkrain!$G140*事前相談チェックシート!$L$28,5)","v":1.3440000000000001E-2},{"$f":"ROUND(1/360*事前相談チェックシート!$R$12*mkrain!$G140*事前相談チェックシート!$M$28,5)","v":2.1999999999999999E-2}]
["23:00:00",{"$f":"ROUND(1/360*事前相談チェックシート!$R$10*mkrain!$G141*事前相談チェックシート!$L$28,5)","v":1.3140000000000001E-2},{"$f":"ROUND(1/360*事前相談チェックシート!$R$12*mkrain!$G141*事前相談チェックシート!$M$28,5)","v":2.1499999999999998E-2}]
["23:10:00",{"$f":"ROUND(1/360*事前相談チェックシート!$R$10*mkrain!$G142*事前相談チェックシート!$L$28,5)","v":1.3140000000000001E-2},{"$f":"ROUND(1/360*事前相談チェックシート!$R$12*mkrain!$G142*事前相談チェックシート!$M$28,5)","v":2.1499999999999998E-2}]
["23:20:00",{"$f":"ROUND(1/360*事前相談チェックシート!$R$10*mkrain!$G143*事前相談チェックシート!$L$28,5)","v":1.2829999999999999E-2},{"$f":"ROUND(1/360*事前相談チェックシート!$R$12*mkrain!$G143*事前相談チェックシート!$M$28,5)","v":2.1000000000000001E-2}]
["23:30:00",{"$f":"ROUND(1/360*事前相談チェックシート!$R$10*mkrain!$G144*事前相談チェックシート!$L$28,5)","v":1.2829999999999999E-2},{"$f":"ROUND(1/360*事前相談チェックシート!$R$12*mkrain!$G144*事前相談チェックシート!$M$28,5)","v":2.1000000000000001E-2}]
["23:40:00",{"$f":"ROUND(1/360*事前相談チェックシート!$R$10*mkrain!$G145*事前相談チェックシート!$L$28,5)","v":1.2529999999999999E-2},{"$f":"ROUND(1/360*事前相談チェックシート!$R$12*mkrain!$G145*事前相談チェックシート!$M$28,5)","v":2.0500000000000001E-2}]
["23:50:00",{"$f":"ROUND(1/360*事前相談チェックシート!$R$10*mkrain!$G146*事前相談チェックシート!$L$28,5)","v":1.2529999999999999E-2},{"$f":"ROUND(1/360*事前相談チェックシート!$R$12*mkrain!$G146*事前相談チェックシート!$M$28,5)","v":2.0500000000000001E-2}]
[1,{"$f":"ROUND(1/360*事前相談チェックシート!$R$10*mkrain!$G147*事前相談チェックシート!$L$28,5)","v":1.2529999999999999E-2},{"$f":"ROUND(1/360*事前相談チェックシート!$R$12*mkrain!$G147*事前相談チェックシート!$M$28,5)","v":2.0500000000000001E-2}]

{"sheet":"逐次計算（概算）","index":24,"n_rows":147,"n_cols":5,"rows_kept":147,"cut":false,"hidden":true,"merged":[]}
["時刻","行為後流入量","許容放流量","調整池水位","調節後放流量"]
[]
[{"$f":"runoff!A4","v":"00:00:00"},{"$f":"runoff!C4","v":0},{"$f":"runoff!$B$1","v":0.47543999999999997},0,0]
[{"$f":"runoff!A5","v":"00:10:00"},{"$f":"runoff!C5","v":2.0500000000000001E-2},{"$f":"runoff!$B$1","v":0.47543999999999997},1.0901711566299658E-2,8.7691918066061969E-4]
[{"$f":"runoff!A6","v":"00:20:00"},{"$f":"runoff!C6","v":2.0500000000000001E-2},{"$f":"runoff!$B$1","v":0.47543999999999997},3.0896141791898077E-2,4.1331064132622154E-3]
[{"$f":"runoff!A7","v":"00:30:00"},{"$f":"runoff!C7","v":2.1000000000000001E-2},{"$f":"runoff!$B$1","v":0.47543999999999997},4.7311527807090088E-2,7.8191987593921701E-3]
[{"$f":"runoff!A8","v":"00:40:00"},{"$f":"runoff!C8","v":2.1000000000000001E-2},{"$f":"runoff!$B$1","v":0.47543999999999997},6.007397526417356E-2,1.1208395817857578E-2]
[{"$f":"runoff!A9","v":"00:50:00"},{"$f":"runoff!C9","v":2.1499999999999998E-2},{"$f":"runoff!$B$1","v":0.47543999999999997},6.9672861983121379E-2,1.4013608088036341E-2]
[{"$f":"runoff!A10","v":"01:00:00"},{"$f":"runoff!C10","v":2.1499999999999998E-2},{"$f":"runoff!$B$1","v":0.47543999999999997},7.6775236739201197E-2,1.6202117351019986E-2]
[{"$f":"runoff!A11","v":"01:10:00"},{"$f":"runoff!C11","v":2.1499999999999998E-2},{"$f":"runoff!$B$1","v":0.47543999999999997},8.1767500336564353E-2,1.781180817372633E-2]
[{"$f":"runoff!A12","v":"01:20:00"},{"$f":"runoff!C12","v":2.1999999999999999E-2},{"$f":"runoff!$B$1","v":0.47543999999999997},8.5471264160382476E-2,1.9021416943401027E-2]
[{"$f":"runoff!A13","v":"01:30:00"},{"$f":"runoff!C13","v":2.1999999999999999E-2},{"$f":"runoff!$B$1","v":0.47543999999999997},8.8255721321275973E-2,1.9966560166990697E-2]
[{"$f":"runoff!A14","v":"01:40:00"},{"$f":"runoff!C14","v":2.2499999999999999E-2},{"$f":"runoff!$B$1","v":0.47543999999999997},9.0376065021954693E-2,2.0716821171787605E-2]
[{"$f":"runoff!A15","v":"01:50:00"},{"$f":"runoff!C15","v":2.2499999999999999E-2},{"$f":"runoff!$B$1","v":0.47543999999999997},9.2053172777377054E-2,2.126438486845213E-2]
[{"$f":"runoff!A16","v":"02:00:00"},{"$f":"runoff!C16","v":2.3E-2},{"$f":"runoff!$B$1","v":0.47543999999999997},9.3420716096620032E-2,2.1774037156910515E-2]
[{"$f":"runoff!A17","v":"02:10:00"},{"$f":"runoff!C17","v":2.3E-2},{"$f":"runoff!$B$1","v":0.47543999999999997},9.4569079766973346E-2,2.2158908236453504E-2]
[{"$f":"runoff!A18","v":"02:20:00"},{"$f":"runoff!C18","v":2.35E-2},{"$f":"runoff!$B$1","v":0.47543999999999997},9.5590298619546765E-2,2.2502897828914341E-2]
[{"$f":"runoff!A19","v":"02:30:00"},{"$f":"runoff!C19","v":2.4E-2},{"$f":"runoff!$B$1","v":0.47543999999999997},9.6735710206453038E-2,2.2935361314654363E-2]
[{"$f":"runoff!A20","v":"02:40:00"},{"$f":"runoff!C20","v":2.4E-2},{"$f":"runoff!$B$1","v":0.47543999999999997},9.7725341457241724E-2,2.3283302433926026E-2]
[{"$f":"runoff!A21","v":"02:50:00"},{"$f":"runoff!C21","v":2.4500000000000001E-2},{"$f":"runoff!$B$1","v":0.47543999999999997},9.8629517820126703E-2,2.3589180112880997E-2]
[{"$f":"runoff!A22","v":"03:00:00"},{"$f":"runoff!C22","v":2.4500000000000001E-2},{"$f":"runoff!$B$1","v":0.47543999999999997},9.9470870177788995E-2,2.3896385643326884E-2]
[{"$f":"runoff!A23","v":"03:10:00"},{"$f":"runoff!C23","v":2.5000000000000001E-2},{"$f":"runoff!$B$1","v":0.47543999999999997},0.10027245748878497,2.4160757196880364E-2]
[{"$f":"runoff!A24","v":"03:20:00"},{"$f":"runoff!C24","v":2.5499999999999998E-2},{"$f":"runoff!$B$1","v":0.47543999999999997},0.10128606045023085,2.4514757472517038E-2]
[{"$f":"runoff!A25","v":"03:30:00"},{"$f":"runoff!C25","v":2.5499999999999998E-2},{"$f":"runoff!$B$1","v":0.47543999999999997},0.10218315631052445,2.4870469978954472E-2]
[{"$f":"runoff!A26","v":"03:40:00"},{"$f":"runoff!C26","v":2.5999999999999999E-2},{"$f":"runoff!$B$1","v":0.47543999999999997},0.10298671935819036,2.5183116535246908E-2]
[{"$f":"runoff!A27","v":"03:50:00"},{"$f":"runoff!C27","v":2.6499999999999999E-2},{"$f":"runoff!$B$1","v":0.47543999999999997},0.10397275602866851,2.5542017457892401E-2]
[{"$f":"runoff!A28","v":"04:00:00"},{"$f":"runoff!C28","v":2.6499999999999999E-2},{"$f":"runoff!$B$1","v":0.47543999999999997},0.10486194549024073,2.5857441511277598E-2]
[{"$f":"runoff!A29","v":"04:10:00"},{"$f":"runoff!C29","v":2.7E-2},{"$f":"runoff!$B$1","v":0.47543999999999997},0.10567772609832918,2.617415339416319E-2]
[{"$f":"runoff!A30","v":"04:20:00"},{"$f":"runoff!C30","v":2.75E-2},{"$f":"runoff!$B$1","v":0.47543999999999997},0.10667115194697116,2.6537680078281244E-2]
[{"$f":"runoff!A31","v":"04:30:00"},{"$f":"runoff!C31","v":2.8000000000000001E-2},{"$f":"runoff!$B$1","v":0.47543999999999997},0.10778986274550301,2.6948640484361432E-2]
[{"$f":"runoff!A32","v":"04:40:00"},{"$f":"runoff!C32","v":2.8500000000000001E-2},{"$f":"runoff!$B$1","v":0.47543999999999997},0.10898077061671257,2.7407725347461352E-2]
[{"$f":"runoff!A33","v":"04:50:00"},{"$f":"runoff!C33","v":2.9000000000000001E-2},{"$f":"runoff!$B$1","v":0.47543999999999997},0.11021570768776887,2.7869387924637324E-2]
[{"$f":"runoff!A34","v":"05:00:00"},{"$f":"runoff!C34","v":2.9499999999999998E-2},{"$f":"runoff!$B$1","v":0.47543999999999997},0.11149181778371818,2.8333613902653917E-2]
[{"$f":"runoff!A35","v":"05:10:00"},{"$f":"runoff!C35","v":0.03},{"$f":"runoff!$B$1","v":0.47543999999999997},0.11278025094228612,2.8847206411923794E-2]
[{"$f":"runoff!A36","v":"05:20:00"},{"$f":"runoff!C36","v":3.0499999999999999E-2},{"$f":"runoff!$B$1","v":0.47543999999999997},0.11407804183381166,2.9316769983330253E-2]
[{"$f":"runoff!A37","v":"05:30:00"},{"$f":"runoff!C37","v":3.1E-2},{"$f":"runoff!$B$1","v":0.47543999999999997},0.1153819470806064,2.9836200572439207E-2]
[{"$f":"runoff!A38","v":"05:40:00"},{"$f":"runoff!C38","v":3.15E-2},{"$f":"runoff!$B$1","v":0.47543999999999997},0.11666257833556301,3.0358663168638906E-2]
[{"$f":"runoff!A39","v":"05:50:00"},{"$f":"runoff!C39","v":3.2000000000000001E-2},{"$f":"runoff!$B$1","v":0.47543999999999997},0.11794318462036177,3.0836245518723316E-2]
[{"$f":"runoff!A40","v":"06:00:00"},{"$f":"runoff!C40","v":3.2500000000000001E-2},{"$f":"runoff!$B$1","v":0.47543999999999997},0.11922057701878545,3.1364448164114031E-2]
[{"$f":"runoff!A41","v":"06:10:00"},{"$f":"runoff!C41","v":3.3000000000000002E-2},{"$f":"runoff!$B$1","v":0.47543999999999997},0.12049187222815358,3.1847220459023336E-2]
[{"$f":"runoff!A42","v":"06:20:00"},{"$f":"runoff!C42","v":3.4000000000000002E-2},{"$f":"runoff!$B$1","v":0.47543999999999997},0.12200464829435152,3.2429782621820356E-2]
[{"$f":"runoff!A43","v":"06:30:00"},{"$f":"runoff!C43","v":3.4500000000000003E-2},{"$f":"runoff!$B$1","v":0.47543999999999997},0.12364706207219139,3.3113872578067874E-2]
[{"$f":"runoff!A44","v":"06:40:00"},{"$f":"runoff!C44","v":3.5499999999999997E-2},{"$f":"runoff!$B$1","v":0.47543999999999997},0.12536007386501793,3.3802706194844379E-2]
[{"$f":"runoff!A45","v":"06:50:00"},{"$f":"runoff!C45","v":3.5999999999999997E-2},{"$f":"runoff!$B$1","v":0.47543999999999997},0.12713843096397226,3.4496251027037815E-2]
[{"$f":"runoff!A46","v":"07:00:00"},{"$f":"runoff!C46","v":3.6999999999999998E-2},{"$f":"runoff!$B$1","v":0.47543999999999997},0.12894911001535173,3.5244526680479109E-2]
[{"$f":"runoff!A47","v":"07:10:00"},{"$f":"runoff!C47","v":3.7999999999999999E-2},{"$f":"runoff!$B$1","v":0.47543999999999997},0.13098047407131158,3.6099018018793144E-2]
[{"$f":"runoff!A48","v":"07:20:00"},{"$f":"runoff!C48","v":3.85E-2},{"$f":"runoff!$B$1","v":0.47543999999999997},0.13292021164316445,3.6909454351871714E-2]
[{"$f":"runoff!A49","v":"07:30:00"},{"$f":"runoff!C49","v":3.95E-2},{"$f":"runoff!$B$1","v":0.47543999999999997},0.13478947789920581,3.772586638725383E-2]
[{"$f":"runoff!A50","v":"07:40:00"},{"$f":"runoff!C50","v":4.1000000000000002E-2},{"$f":"runoff!$B$1","v":0.47543999999999997},0.13707987505714334,3.8651418728458641E-2]
[{"$f":"runoff!A51","v":"07:50:00"},{"$f":"runoff!C51","v":4.2000000000000003E-2},{"$f":"runoff!$B$1","v":0.47543999999999997},0.13963984319053679,3.9740638631433095E-2]
[{"$f":"runoff!A52","v":"08:00:00"},{"$f":"runoff!C52","v":4.2999999999999997E-2},{"$f":"runoff!$B$1","v":0.47543999999999997},0.14212430511187599,4.078732991015635E-2]
[{"$f":"runoff!A53","v":"08:10:00"},{"$f":"runoff!C53","v":4.4499999999999998E-2},{"$f":"runoff!$B$1","v":0.47543999999999997},0.14477072268317737,4.1949118461501185E-2]
[{"$f":"runoff!A54","v":"08:20:00"},{"$f":"runoff!C54","v":4.5499999999999999E-2},{"$f":"runoff!$B$1","v":0.47543999999999997},0.14750913851132252,4.3121733047837521E-2]
[{"$f":"runoff!A55","v":"08:30:00"},{"$f":"runoff!C55","v":4.7E-2},{"$f":"runoff!$B$1","v":0.47543999999999997},0.15029755560387406,4.4359116185569709E-2]
[{"$f":"runoff!A56","v":"08:40:00"},{"$f":"runoff!C56","v":4.9000000000000002E-2},{"$f":"runoff!$B$1","v":0.47543999999999997},0.153527764281921,4.582650819394582E-2]
[{"$f":"runoff!A57","v":"08:50:00"},{"$f":"runoff!C57","v":5.0500000000000003E-2},{"$f":"runoff!$B$1","v":0.47543999999999997},0.15703249912975259,4.7364969079957311E-2]
[{"$f":"runoff!A58","v":"09:00:00"},{"$f":"runoff!C58","v":5.2499999999999998E-2},{"$f":"runoff!$B$1","v":0.47543999999999997},0.16070084770761564,4.9032003479889279E-2]
[{"$f":"runoff!A59","v":"09:10:00"},{"$f":"runoff!C59","v":5.45E-2},{"$f":"runoff!$B$1","v":0.47543999999999997},0.16463428669990113,5.0887806333996817E-2]
[{"$f":"runoff!A60","v":"09:20:00"},{"$f":"runoff!C60","v":5.7000000000000002E-2},{"$f":"runoff!$B$1","v":0.47543999999999997},0.16892937527000565,5.2881034239815036E-2]
[{"$f":"runoff!A61","v":"09:30:00"},{"$f":"runoff!C61","v":5.9499999999999997E-2},{"$f":"runoff!$B$1","v":0.47543999999999997},0.17367667853918542,5.5073819875661421E-2]
[{"$f":"runoff!A62","v":"09:40:00"},{"$f":"runoff!C62","v":6.25E-2},{"$f":"runoff!$B$1","v":0.47543999999999997},0.17886306485918685,5.7590684748336021E-2]
[{"$f":"runoff!A63","v":"09:50:00"},{"$f":"runoff!C63","v":6.5500000000000003E-2},{"$f":"runoff!$B$1","v":0.47543999999999997},0.18446583485252904,6.0324329263648009E-2]
[{"$f":"runoff!A64","v":"10:00:00"},{"$f":"runoff!C64","v":6.9500000000000006E-2},{"$f":"runoff!$B$1","v":0.47543999999999997},0.19072781800300545,6.3404101065494448E-2]
[{"$f":"runoff!A65","v":"10:10:00"},{"$f":"runoff!C65","v":7.3499999999999996E-2},{"$f":"runoff!$B$1","v":0.47543999999999997},0.19774323190364801,6.6968153913348941E-2]
[{"$f":"runoff!A66","v":"10:20:00"},{"$f":"runoff!C66","v":7.85E-2},{"$f":"runoff!$B$1","v":0.47543999999999997},0.20555226990730813,7.0975577680062837E-2]
[{"$f":"runoff!A67","v":"10:30:00"},{"$f":"runoff!C67","v":8.4500000000000006E-2},{"$f":"runoff!$B$1","v":0.47543999999999997},0.21461865945549674,7.5704921133197683E-2]
[{"$f":"runoff!A68","v":"10:40:00"},{"$f":"runoff!C68","v":9.1499999999999998E-2},{"$f":"runoff!$B$1","v":0.47543999999999997},0.22515622844753849,8.1327454681127134E-2]
[{"$f":"runoff!A69","v":"10:50:00"},{"$f":"runoff!C69","v":0.1},{"$f":"runoff!$B$1","v":0.47543999999999997},0.23741883191302737,8.8099859080992882E-2]
[{"$f":"runoff!A70","v":"11:00:00"},{"$f":"runoff!C70","v":0.111},{"$f":"runoff!$B$1","v":0.47543999999999997},0.25215360374935825,9.637755161361157E-2]
[{"$f":"runoff!A71","v":"11:10:00"},{"$f":"runoff!C71","v":0.1255},{"$f":"runoff!$B$1","v":0.47543999999999997},0.27047735102237375,0.10713970329496048]
[{"$f":"runoff!A72","v":"11:20:00"},{"$f":"runoff!C72","v":0.14499999999999999},{"$f":"runoff!$B$1","v":0.47543999999999997},0.29385207397235874,0.12128579539506652]
[{"$f":"runoff!A73","v":"11:30:00"},{"$f":"runoff!C73","v":0.17399999999999999},{"$f":"runoff!$B$1","v":0.47543999999999997},0.3252375754019271,0.14122030203171043]
[{"$f":"runoff!A74","v":"11:40:00"},{"$f":"runoff!C74","v":0.2225},{"$f":"runoff!$B$1","v":0.47543999999999997},0.37132653150628681,0.17231957698044204]
[{"$f":"runoff!A75","v":"11:50:00"},{"$f":"runoff!C75","v":0.32250000000000001},{"$f":"runoff!$B$1","v":0.47543999999999997},0.45047347715144764,0.23021592085826856]
[{"$f":"runoff!A76","v":"12:00:00"},{"$f":"runoff!C76","v":0.77800000000000002},{"$f":"runoff!$B$1","v":0.47543999999999997},0.73653541817669077,0.35537258529629379]
[{"$f":"runoff!A77","v":"12:10:00"},{"$f":"runoff!C77","v":0.435},{"$f":"runoff!$B$1","v":0.47543999999999997},0.98480418063019048,0.41074364228740656]
[{"$f":"runoff!A78","v":"12:20:00"},{"$f":"runoff!C78","v":0.26150000000000001},{"$f":"runoff!$B$1","v":0.47543999999999997},0.92474039264935037,0.39387117607810551]
[{"$f":"runoff!A79","v":"12:30:00"},{"$f":"runoff!C79","v":0.19450000000000001},{"$f":"runoff!$B$1","v":0.47543999999999997},0.75981888443229739,0.35898753871258976]
[{"$f":"runoff!A80","v":"12:40:00"},{"$f":"runoff!C80","v":0.158},{"$f":"runoff!$B$1","v":0.47543999999999997},0.57294933477191379,0.32987765067610081]
[{"$f":"runoff!A81","v":"12:50:00"},{"$f":"runoff!C81","v":0.13450000000000001},{"$f":"runoff!$B$1","v":0.47543999999999997},0.43205600163787444,0.21623034896517002]
[{"$f":"runoff!A82","v":"13:00:00"},{"$f":"runoff!C82","v":0.11799999999999999},{"$f":"runoff!$B$1","v":0.47543999999999997},0.3605966191512982,0.16489653951066727]
[{"$f":"runoff!A83","v":"13:10:00"},{"$f":"runoff!C83","v":0.1055},{"$f":"runoff!$B$1","v":0.47543999999999997},0.31746491228117385,0.13624053285555651]
[{"$f":"runoff!A84","v":"13:20:00"},{"$f":"runoff!C84","v":9.5500000000000002E-2},{"$f":"runoff!$B$1","v":0.47543999999999997},0.28802529145860728,0.11775078462506336]
[{"$f":"runoff!A85","v":"13:30:00"},{"$f":"runoff!C85","v":8.7999999999999995E-2},{"$f":"runoff!$B$1","v":0.47543999999999997},0.26639517482412522,0.10468342531700434]
[{"$f":"runoff!A86","v":"13:40:00"},{"$f":"runoff!C86","v":8.1500000000000003E-2},{"$f":"runoff!$B$1","v":0.47543999999999997},0.24963727787875462,9.4980789184662781E-2]
[{"$f":"runoff!A87","v":"13:50:00"},{"$f":"runoff!C87","v":7.5999999999999998E-2},{"$f":"runoff!$B$1","v":0.47543999999999997},0.23591568763700296,8.7218073250490177E-2]
[{"$f":"runoff!A88","v":"14:00:00"},{"$f":"runoff!C88","v":7.1499999999999994E-2},{"$f":"runoff!$B$1","v":0.47543999999999997},0.22444406732527114,8.0930843310627137E-2]
[{"$f":"runoff!A89","v":"14:10:00"},{"$f":"runoff!C89","v":6.7500000000000004E-2},{"$f":"runoff!$B$1","v":0.47543999999999997},0.21464642041203513,7.5704921133197683E-2]
[{"$f":"runoff!A90","v":"14:20:00"},{"$f":"runoff!C90","v":6.4000000000000001E-2},{"$f":"runoff!$B$1","v":0.47543999999999997},0.2060722365080716,7.1228609893936645E-2]
[{"$f":"runoff!A91","v":"14:30:00"},{"$f":"runoff!C91","v":6.0999999999999999E-2},{"$f":"runoff!$B$1","v":0.47543999999999997},0.19853381796315964,6.7340543486904866E-2]
[{"$f":"runoff!A92","v":"14:40:00"},{"$f":"runoff!C92","v":5.8000000000000003E-2},{"$f":"runoff!$B$1","v":0.47543999999999997},0.19173805847661093,6.3891823588882804E-2]
[{"$f":"runoff!A93","v":"14:50:00"},{"$f":"runoff!C93","v":5.6000000000000001E-2},{"$f":"runoff!$B$1","v":0.47543999999999997},0.18569578782161184,6.0984263590115557E-2]
[{"$f":"runoff!A94","v":"15:00:00"},{"$f":"runoff!C94","v":5.3499999999999999E-2},{"$f":"runoff!$B$1","v":0.47543999999999997},0.18026023547093978,5.8299730641094151E-2]
[{"$f":"runoff!A95","v":"15:10:00"},{"$f":"runoff!C95","v":5.1499999999999997E-2},{"$f":"runoff!$B$1","v":0.47543999999999997},0.17518773230702872,5.5830775053945729E-2]
[{"$f":"runoff!A96","v":"15:20:00"},{"$f":"runoff!C96","v":4.9500000000000002E-2},{"$f":"runoff!$B$1","v":0.47543999999999997},0.17048849421378393,5.3627853513894881E-2]
[{"$f":"runoff!A97","v":"15:30:00"},{"$f":"runoff!C97","v":4.8000000000000001E-2},{"$f":"runoff!$B$1","v":0.47543999999999997},0.16618126078858431,5.1625166651464445E-2]
[{"$f":"runoff!A98","v":"15:40:00"},{"$f":"runoff!C98","v":4.65E-2},{"$f":"runoff!$B$1","v":0.47543999999999997},0.1623247758091495,4.9816506311518204E-2]
[{"$f":"runoff!A99","v":"15:50:00"},{"$f":"runoff!C99","v":4.4999999999999998E-2},{"$f":"runoff!$B$1","v":0.47543999999999997},0.15873753548251382,4.8140526276426031E-2]
[{"$f":"runoff!A100","v":"16:00:00"},{"$f":"runoff!C100","v":4.3499999999999997E-2},{"$f":"runoff!$B$1","v":0.47543999999999997},0.15527411976392042,4.6593622017042119E-2]
[{"$f":"runoff!A101","v":"16:10:00"},{"$f":"runoff!C101","v":4.2500000000000003E-2},{"$f":"runoff!$B$1","v":0.47543999999999997},0.15207079132717943,4.5172369169091633E-2]
[{"$f":"runoff!A102","v":"16:20:00"},{"$f":"runoff!C102","v":4.1500000000000002E-2},{"$f":"runoff!$B$1","v":0.47543999999999997},0.14926751201298266,4.3873533596462573E-2]
[{"$f":"runoff!A103","v":"16:30:00"},{"$f":"runoff!C103","v":0.04},{"$f":"runoff!$B$1","v":0.47543999999999997},0.14645217031831731,4.2694081453935058E-2]
[{"$f":"runoff!A104","v":"16:40:00"},{"$f":"runoff!C104","v":3.9E-2},{"$f":"runoff!$B$1","v":0.47543999999999997},0.14361118915985419,4.1419684631298581E-2]
[{"$f":"runoff!A105","v":"16:50:00"},{"$f":"runoff!C105","v":3.85E-2},{"$f":"runoff!$B$1","v":0.47543999999999997},0.14120027732272278,4.0419956675537973E-2]
[{"$f":"runoff!A106","v":"17:00:00"},{"$f":"runoff!C106","v":3.7499999999999999E-2},{"$f":"runoff!$B$1","v":0.47543999999999997},0.1390334202176261,3.9480386113636065E-2]
[{"$f":"runoff!A107","v":"17:10:00"},{"$f":"runoff!C107","v":3.6499999999999998E-2},{"$f":"runoff!$B$1","v":0.47543999999999997},0.13679531087567121,3.8548210701882794E-2]
[{"$f":"runoff!A108","v":"17:20:00"},{"$f":"runoff!C108","v":3.5499999999999997E-2},{"$f":"runoff!$B$1","v":0.47543999999999997},0.13450611828491832,3.7572335961472379E-2]
[{"$f":"runoff!A109","v":"17:30:00"},{"$f":"runoff!C109","v":3.5000000000000003E-2},{"$f":"runoff!$B$1","v":0.47543999999999997},0.132406885345596,3.6706283329307796E-2]
[{"$f":"runoff!A110","v":"17:40:00"},{"$f":"runoff!C110","v":3.4000000000000002E-2},{"$f":"runoff!$B$1","v":0.47543999999999997},0.13043284508434996,3.5846989140935093E-2]
[{"$f":"runoff!A111","v":"17:50:00"},{"$f":"runoff!C111","v":3.3500000000000002E-2},{"$f":"runoff!$B$1","v":0.47543999999999997},0.12852093797521125,3.5094443655514576E-2]
[{"$f":"runoff!A112","v":"18:00:00"},{"$f":"runoff!C112","v":3.3000000000000002E-2},{"$f":"runoff!$B$1","v":0.47543999999999997},0.12685908818665473,3.439688596388718E-2]
[{"$f":"runoff!A113","v":"18:10:00"},{"$f":"runoff!C113","v":3.2500000000000001E-2},{"$f":"runoff!$B$1","v":0.47543999999999997},0.1253593147651372,3.3802706194844379E-2]
[{"$f":"runoff!A114","v":"18:20:00"},{"$f":"runoff!C114","v":3.15E-2},{"$f":"runoff!$B$1","v":0.47543999999999997},0.12371174573905687,3.3162918052100213E-2]
[{"$f":"runoff!A115","v":"18:30:00"},{"$f":"runoff!C115","v":3.1E-2},{"$f":"runoff!$B$1","v":0.47543999999999997},0.12199357869798988,3.2429782621820356E-2]
[{"$f":"runoff!A116","v":"18:40:00"},{"$f":"runoff!C116","v":3.0499999999999999E-2},{"$f":"runoff!$B$1","v":0.47543999999999997},0.12045079920863229,3.1847220459023336E-2]
[{"$f":"runoff!A117","v":"18:50:00"},{"$f":"runoff!C117","v":0.03},{"$f":"runoff!$B$1","v":0.47543999999999997},0.11899779393683993,3.1268189030202925E-2]
[{"$f":"runoff!A118","v":"19:00:00"},{"$f":"runoff!C118","v":2.9499999999999998E-2},{"$f":"runoff!$B$1","v":0.47543999999999997},0.11760406093901912,3.0740530365874499E-2]
[{"$f":"runoff!A119","v":"19:10:00"},{"$f":"runoff!C119","v":2.9000000000000001E-2},{"$f":"runoff!$B$1","v":0.47543999999999997},0.11626580680803077,3.0168327069904546E-2]
[{"$f":"runoff!A120","v":"19:20:00"},{"$f":"runoff!C120","v":2.8500000000000001E-2},{"$f":"runoff!$B$1","v":0.47543999999999997},0.11495327163240165,2.9694236246227832E-2]
[{"$f":"runoff!A121","v":"19:30:00"},{"$f":"runoff!C121","v":2.8000000000000001E-2},{"$f":"runoff!$B$1","v":0.47543999999999997},0.1136366761374413,2.9175635644700829E-2]
[{"$f":"runoff!A122","v":"19:40:00"},{"$f":"runoff!C122","v":2.75E-2},{"$f":"runoff!$B$1","v":0.47543999999999997},0.11233905091092446,2.8660089763029487E-2]
[{"$f":"runoff!A123","v":"19:50:00"},{"$f":"runoff!C123","v":2.75E-2},{"$f":"runoff!$B$1","v":0.47543999999999997},0.11125729195655278,2.8287076354839544E-2]
[{"$f":"runoff!A124","v":"20:00:00"},{"$f":"runoff!C124","v":2.7E-2},{"$f":"runoff!$B$1","v":0.47543999999999997},0.11031130764636121,2.7915695403505286E-2]
[{"$f":"runoff!A125","v":"20:10:00"},{"$f":"runoff!C125","v":2.6499999999999999E-2},{"$f":"runoff!$B$1","v":0.47543999999999997},0.10924711458483456,2.7499852107242692E-2]
[{"$f":"runoff!A126","v":"20:20:00"},{"$f":"runoff!C126","v":2.5999999999999999E-2},{"$f":"runoff!$B$1","v":0.47543999999999997},0.10808825540191712,2.708609442200868E-2]
[{"$f":"runoff!A127","v":"20:30:00"},{"$f":"runoff!C127","v":2.5999999999999999E-2},{"$f":"runoff!$B$1","v":0.47543999999999997},0.10708483114825081,2.672006923459069E-2]
[{"$f":"runoff!A128","v":"20:40:00"},{"$f":"runoff!C128","v":2.5499999999999998E-2},{"$f":"runoff!$B$1","v":0.47543999999999997},0.10620939945548903,2.6355707812380499E-2]
[{"$f":"runoff!A129","v":"20:50:00"},{"$f":"runoff!C129","v":2.5000000000000001E-2},{"$f":"runoff!$B$1","v":0.47543999999999997},0.1051823296777616,2.599301778752889E-2]
[{"$f":"runoff!A130","v":"21:00:00"},{"$f":"runoff!C130","v":2.5000000000000001E-2},{"$f":"runoff!$B$1","v":0.47543999999999997},0.10427953818569365,2.5632006898193449E-2]
[{"$f":"runoff!A131","v":"21:10:00"},{"$f":"runoff!C131","v":2.4500000000000001E-2},{"$f":"runoff!$B$1","v":0.47543999999999997},0.10344933692004776,2.5362355379969136E-2]
[{"$f":"runoff!A132","v":"21:20:00"},{"$f":"runoff!C132","v":2.4E-2},{"$f":"runoff!$B$1","v":0.47543999999999997},0.10243710355461809,2.4959664677804277E-2]
[{"$f":"runoff!A133","v":"21:30:00"},{"$f":"runoff!C133","v":2.4E-2},{"$f":"runoff!$B$1","v":0.47543999999999997},0.10154398459276565,2.4647949453530126E-2]
[{"$f":"runoff!A134","v":"21:40:00"},{"$f":"runoff!C134","v":2.35E-2},{"$f":"runoff!$B$1","v":0.47543999999999997},0.10071871112494239,2.4337542788551735E-2]
[{"$f":"runoff!A135","v":"21:50:00"},{"$f":"runoff!C135","v":2.35E-2},{"$f":"runoff!$B$1","v":0.47543999999999997},9.9935339777627211E-2,2.4072525636615584E-2]
[{"$f":"runoff!A136","v":"22:00:00"},{"$f":"runoff!C136","v":2.3E-2},{"$f":"runoff!$B$1","v":0.47543999999999997},9.9192512254806922E-2,2.376456390446096E-2]
[{"$f":"runoff!A137","v":"22:10:00"},{"$f":"runoff!C137","v":2.3E-2},{"$f":"runoff!$B$1","v":0.47543999999999997},9.8464753491020504E-2,2.3545401870354588E-2]
[{"$f":"runoff!A138","v":"22:20:00"},{"$f":"runoff!C138","v":2.2499999999999999E-2},{"$f":"runoff!$B$1","v":0.47543999999999997},9.7750800032309515E-2,2.3239714355325212E-2]
[{"$f":"runoff!A139","v":"22:30:00"},{"$f":"runoff!C139","v":2.2499999999999999E-2},{"$f":"runoff!$B$1","v":0.47543999999999997},9.7049746049245003E-2,2.3022182814190911E-2]
[{"$f":"runoff!A140","v":"22:40:00"},{"$f":"runoff!C140","v":2.1999999999999999E-2},{"$f":"runoff!$B$1","v":0.47543999999999997},9.6336285207098415E-2,2.2762046701672922E-2]
[{"$f":"runoff!A141","v":"22:50:00"},{"$f":"runoff!C141","v":2.1999999999999999E-2},{"$f":"runoff!$B$1","v":0.47543999999999997},9.5609581156331988E-2,2.2546020589706648E-2]
[{"$f":"runoff!A142","v":"23:00:00"},{"$f":"runoff!C142","v":2.1499999999999998E-2},{"$f":"runoff!$B$1","v":0.47543999999999997},9.4892491955784142E-2,2.2244739971279487E-2]
[{"$f":"runoff!A143","v":"23:10:00"},{"$f":"runoff!C143","v":2.1499999999999998E-2},{"$f":"runoff!$B$1","v":0.47543999999999997},9.4184098525857254E-2,2.2030368202588909E-2]
[{"$f":"runoff!A144","v":"23:20:00"},{"$f":"runoff!C144","v":2.1000000000000001E-2},{"$f":"runoff!$B$1","v":0.47543999999999997},9.3459428881690912E-2,2.1774037156910515E-2]
[{"$f":"runoff!A145","v":"23:30:00"},{"$f":"runoff!C145","v":2.1000000000000001E-2},{"$f":"runoff!$B$1","v":0.47543999999999997},9.2741237092808043E-2,2.1518708063078651E-2]
[{"$f":"runoff!A146","v":"23:40:00"},{"$f":"runoff!C146","v":2.0500000000000001E-2},{"$f":"runoff!$B$1","v":0.47543999999999997},9.2028407686402053E-2,2.126438486845213E-2]
[{"$f":"runoff!A147","v":"23:50:00"},{"$f":"runoff!C147","v":2.0500000000000001E-2},{"$f":"runoff!$B$1","v":0.47543999999999997},9.1319820777587102E-2,2.1011071567414781E-2]
[{"$f":"runoff!A148","v":1},{"$f":"runoff!C148","v":2.0500000000000001E-2},{"$f":"runoff!$B$1","v":0.47543999999999997},9.0845470418132693E-2,2.0842759079603149E-2]

{"sheet":"浸透計算","index":25,"n_rows":149,"n_cols":7,"rows_kept":149,"cut":false,"hidden":true,"merged":[]}
[8,9,10]
[null,{"$f":"MAX(B5:B149)","v":0.77800000000000002},{"$f":"MAX(C5:C149)","v":0.77800000000000002}]
[]
["時刻","浸透考慮前","浸透考慮後","許容放流量"]
["00:00:00",0,0,{"$f":"事前相談チェックシート!U25","v":0.1},null,null,0]
["00:10:00",2.0500000000000001E-2,2.0500000000000001E-2,{"$f":"D5","v":0.1},null,null,{"$f":"G5+1/6","v":0.16666666666666666}]
["00:20:00",2.0500000000000001E-2,2.0500000000000001E-2,{"$f":"D6","v":0.1},null,null,{"$f":"G6+1/6","v":0.33333333333333331}]
["00:30:00",2.1000000000000001E-2,2.1000000000000001E-2,0.1,null,null,0.5]
["00:40:00",2.1000000000000001E-2,2.1000000000000001E-2,0.1,null,null,0.66666666666666663]
["00:50:00",2.1499999999999998E-2,2.1499999999999998E-2,0.1,null,null,0.83333333333333326]
["01:00:00",2.1499999999999998E-2,2.1499999999999998E-2,0.1,null,null,0.99999999999999989]
["01:10:00",2.1499999999999998E-2,2.1499999999999998E-2,0.1,null,null,1.1666666666666665]
["01:20:00",2.1999999999999999E-2,2.1999999999999999E-2,0.1,null,null,1.3333333333333333]
["01:30:00",2.1999999999999999E-2,2.1999999999999999E-2,0.1,null,null,1.5]
["01:40:00",2.2499999999999999E-2,2.2499999999999999E-2,0.1,null,null,1.6666666666666667]
["01:50:00",2.2499999999999999E-2,2.2499999999999999E-2,0.1,null,null,1.8333333333333335]
["02:00:00",2.3E-2,2.3E-2,0.1,null,null,2]
["02:10:00",2.3E-2,2.3E-2,0.1,null,null,2.1666666666666665]
["02:20:00",2.35E-2,2.35E-2,0.1,null,null,2.333333333333333]
["02:30:00",2.4E-2,2.4E-2,0.1,null,null,2.4999999999999996]
["02:40:00",2.4E-2,2.4E-2,0.1,null,null,2.6666666666666661]
["02:50:00",2.4500000000000001E-2,2.4500000000000001E-2,0.1,null,null,2.8333333333333326]
["03:00:00",2.4500000000000001E-2,2.4500000000000001E-2,0.1,null,null,2.9999999999999991]
["03:10:00",2.5000000000000001E-2,2.5000000000000001E-2,0.1,null,null,3.1666666666666656]
["03:20:00",2.5499999999999998E-2,2.5499999999999998E-2,0.1,null,null,3.3333333333333321]
["03:30:00",2.5499999999999998E-2,2.5499999999999998E-2,0.1,null,null,3.4999999999999987]
["03:40:00",2.5999999999999999E-2,2.5999999999999999E-2,0.1,null,null,3.6666666666666652]
["03:50:00",2.6499999999999999E-2,2.6499999999999999E-2,0.1,null,null,3.8333333333333317]
["04:00:00",2.6499999999999999E-2,2.6499999999999999E-2,0.1,null,null,3.9999999999999982]
["04:10:00",2.7E-2,2.7E-2,0.1,null,null,4.1666666666666652]
["04:20:00",2.75E-2,2.75E-2,0.1,null,null,4.3333333333333321]
["04:30:00",2.8000000000000001E-2,2.8000000000000001E-2,0.1,null,null,4.4999999999999991]
["04:40:00",2.8500000000000001E-2,2.8500000000000001E-2,0.1,null,null,4.6666666666666661]
["04:50:00",2.9000000000000001E-2,2.9000000000000001E-2,0.1,null,null,4.833333333333333]
["05:00:00",2.9499999999999998E-2,2.9499999999999998E-2,0.1,null,null,5]
["05:10:00",0.03,0.03,0.1,null,null,5.166666666666667]
["05:20:00",3.0499999999999999E-2,3.0499999999999999E-2,0.1,null,null,5.3333333333333339]
["05:30:00",3.1E-2,3.1E-2,0.1,null,null,5.5000000000000009]
["05:40:00",3.15E-2,3.15E-2,0.1,null,null,5.6666666666666679]
["05:50:00",3.2000000000000001E-2,3.2000000000000001E-2,0.1,null,null,5.8333333333333348]
["06:00:00",3.2500000000000001E-2,3.2500000000000001E-2,0.1,null,null,6.0000000000000018]
["06:10:00",3.3000000000000002E-2,3.3000000000000002E-2,0.1,null,null,6.1666666666666687]
["06:20:00",3.4000000000000002E-2,3.4000000000000002E-2,0.1,null,null,6.3333333333333357]
["06:30:00",3.4500000000000003E-2,3.4500000000000003E-2,0.1,null,null,6.5000000000000027]
["06:40:00",3.5499999999999997E-2,3.5499999999999997E-2,0.1,null,null,6.6666666666666696]
["06:50:00",3.5999999999999997E-2,3.5999999999999997E-2,0.1,null,null,6.8333333333333366]
["07:00:00",3.6999999999999998E-2,3.6999999999999998E-2,0.1,null,null,7.0000000000000036]
["07:10:00",3.7999999999999999E-2,3.7999999999999999E-2,0.1,null,null,7.1666666666666705]
["07:20:00",3.85E-2,3.85E-2,0.1,null,null,7.3333333333333375]
["07:30:00",3.95E-2,3.95E-2,0.1,null,null,7.5000000000000044]
["07:40:00",4.1000000000000002E-2,4.1000000000000002E-2,0.1,null,null,7.6666666666666714]
["07:50:00",4.2000000000000003E-2,4.2000000000000003E-2,0.1,null,null,7.8333333333333384]
["08:00:00",4.2999999999999997E-2,4.2999999999999997E-2,0.1,null,null,8.0000000000000053]
["08:10:00",4.4499999999999998E-2,4.4499999999999998E-2,0.1,null,null,8.1666666666666714]
["08:20:00",4.5499999999999999E-2,4.5499999999999999E-2,0.1,null,null,8.3333333333333375]
["08:30:00",4.7E-2,4.7E-2,0.1,null,null,8.5000000000000036]
["08:40:00",4.9000000000000002E-2,4.9000000000000002E-2,0.1,null,null,8.6666666666666696]
["08:50:00",5.0500000000000003E-2,5.0500000000000003E-2,0.1,null,null,8.8333333333333357]
["09:00:00",5.2499999999999998E-2,5.2499999999999998E-2,0.1,null,null,9.0000000000000018]
["09:10:00",5.45E-2,5.45E-2,0.1,null,null,9.1666666666666679]
["09:20:00",5.7000000000000002E-2,5.7000000000000002E-2,0.1,null,null,9.3333333333333339]
["09:30:00",5.9499999999999997E-2,5.9499999999999997E-2,0.1,null,null,9.5]
["09:40:00",6.25E-2,6.25E-2,0.1,null,null,9.6666666666666661]
["09:50:00",6.5500000000000003E-2,6.5500000000000003E-2,0.1,null,null,9.8333333333333321]
["10:00:00",6.9500000000000006E-2,6.9500000000000006E-2,0.1,null,null,9.9999999999999982]
["10:10:00",7.3499999999999996E-2,7.3499999999999996E-2,0.1,null,null,10.166666666666664]
["10:20:00",7.85E-2,7.85E-2,0.1,null,null,10.33333333333333]
["10:30:00",8.4500000000000006E-2,8.4500000000000006E-2,0.1,null,null,10.499999999999996]
["10:40:00",9.1499999999999998E-2,9.1499999999999998E-2,0.1,null,null,10.666666666666663]
["10:50:00",0.1,0.1,0.1,null,null,10.833333333333329]
["11:00:00",0.111,0.111,{"$f":"D70","v":0.1},null,null,{"$f":"G70+1/6","v":10.999999999999995}]
["11:10:00",0.1255,0.1255,0.1,null,null,11.166666666666661]
["11:20:00",0.14499999999999999,0.14499999999999999,0.1,null,null,11.333333333333327]
["11:30:00",0.17399999999999999,0.17399999999999999,0.1,null,null,11.499999999999993]
["11:40:00",0.2225,0.2225,0.1,null,null,11.666666666666659]
["11:50:00",0.32250000000000001,0.32250000000000001,0.1,null,null,11.833333333333325]
["12:00:00",0.77800000000000002,0.77800000000000002,0.1,null,null,11.999999999999991]
["12:10:00",0.435,0.435,0.1,null,null,12.166666666666657]
["12:20:00",0.26150000000000001,0.26150000000000001,0.1,null,null,12.333333333333323]
["12:30:00",0.19450000000000001,0.19450000000000001,0.1,null,null,12.499999999999989]
["12:40:00",0.158,0.158,0.1,null,null,12.666666666666655]
["12:50:00",0.13450000000000001,0.13450000000000001,0.1,null,null,12.833333333333321]
["13:00:00",0.11799999999999999,0.11799999999999999,0.1,null,null,12.999999999999988]
["13:10:00",0.1055,0.1055,0.1,null,null,13.166666666666654]
["13:20:00",9.5500000000000002E-2,9.5500000000000002E-2,0.1,null,null,13.33333333333332]
["13:30:00",8.7999999999999995E-2,8.7999999999999995E-2,0.1,null,null,13.499999999999986]
["13:40:00",8.1500000000000003E-2,8.1500000000000003E-2,0.1,null,null,13.666666666666652]
["13:50:00",7.5999999999999998E-2,7.5999999999999998E-2,0.1,null,null,13.833333333333318]
["14:00:00",7.1499999999999994E-2,7.1499999999999994E-2,0.1,null,null,13.999999999999984]
["14:10:00",6.7500000000000004E-2,6.7500000000000004E-2,0.1,null,null,14.16666666666665]
["14:20:00",6.4000000000000001E-2,6.4000000000000001E-2,0.1,null,null,14.333333333333316]
["14:30:00",6.0999999999999999E-2,6.0999999999999999E-2,0.1,null,null,14.499999999999982]
["14:40:00",5.8000000000000003E-2,5.8000000000000003E-2,0.1,null,null,14.666666666666648]
["14:50:00",5.6000000000000001E-2,5.6000000000000001E-2,0.1,null,null,14.833333333333314]
["15:00:00",5.3499999999999999E-2,5.3499999999999999E-2,0.1,null,null,14.99999999999998]
["15:10:00",5.1499999999999997E-2,5.1499999999999997E-2,0.1,null,null,15.166666666666647]
["15:20:00",4.9500000000000002E-2,4.9500000000000002E-2,0.1,null,null,15.333333333333313]
["15:30:00",4.8000000000000001E-2,4.8000000000000001E-2,0.1,null,null,15.499999999999979]
["15:40:00",4.65E-2,4.65E-2,0.1,null,null,15.666666666666645]
["15:50:00",4.4999999999999998E-2,4.4999999999999998E-2,0.1,null,null,15.833333333333311]
["16:00:00",4.3499999999999997E-2,4.3499999999999997E-2,0.1,null,null,15.999999999999977]
["16:10:00",4.2500000000000003E-2,4.2500000000000003E-2,0.1,null,null,16.166666666666643]
["16:20:00",4.1500000000000002E-2,4.1500000000000002E-2,0.1,null,null,16.333333333333311]
["16:30:00",0.04,0.04,0.1,null,null,16.499999999999979]
["16:40:00",3.9E-2,3.9E-2,0.1,null,null,16.666666666666647]
["16:50:00",3.85E-2,3.85E-2,0.1,null,null,16.833333333333314]
["17:00:00",3.7499999999999999E-2,3.7499999999999999E-2,0.1,null,null,16.999999999999982]
["17:10:00",3.6499999999999998E-2,3.6499999999999998E-2,0.1,null,null,17.16666666666665]
["17:20:00",3.5499999999999997E-2,3.5499999999999997E-2,0.1,null,null,17.333333333333318]
["17:30:00",3.5000000000000003E-2,3.5000000000000003E-2,0.1,null,null,17.499999999999986]
["17:40:00",3.4000000000000002E-2,3.4000000000000002E-2,0.1,null,null,17.666666666666654]
["17:50:00",3.3500000000000002E-2,3.3500000000000002E-2,0.1,null,null,17.833333333333321]
["18:00:00",3.3000000000000002E-2,3.3000000000000002E-2,0.1,null,null,17.999999999999989]
["18:10:00",3.2500000000000001E-2,3.2500000000000001E-2,0.1,null,null,18.166666666666657]
["18:20:00",3.15E-2,3.15E-2,0.1,null,null,18.333333333333325]
["18:30:00",3.1E-2,3.1E-2,0.1,null,null,18.499999999999993]
["18:40:00",3.0499999999999999E-2,3.0499999999999999E-2,0.1,null,null,18.666666666666661]
["18:50:00",0.03,0.03,0.1,null,null,18.833333333333329]
["19:00:00",2.9499999999999998E-2,2.9499999999999998E-2,0.1,null,null,18.999999999999996]
["19:10:00",2.9000000000000001E-2,2.9000000000000001E-2,0.1,null,null,19.166666666666664]
["19:20:00",2.8500000000000001E-2,2.8500000000000001E-2,0.1,null,null,19.333333333333332]
["19:30:00",2.8000000000000001E-2,2.8000000000000001E-2,0.1,null,null,19.5]
["19:40:00",2.75E-2,2.75E-2,0.1,null,null,19.666666666666668]
["19:50:00",2.75E-2,2.75E-2,0.1,null,null,19.833333333333336]
["20:00:00",2.7E-2,2.7E-2,0.1,null,null,20.000000000000004]
["20:10:00",2.6499999999999999E-2,2.6499999999999999E-2,0.1,null,null,20.166666666666671]
["20:20:00",2.5999999999999999E-2,2.5999999999999999E-2,0.1,null,null,20.333333333333339]
["20:30:00",2.5999999999999999E-2,2.5999999999999999E-2,0.1,null,null,20.500000000000007]
["20:40:00",2.5499999999999998E-2,2.5499999999999998E-2,0.1,null,null,20.666666666666675]
["20:50:00",2.5000000000000001E-2,2.5000000000000001E-2,0.1,null,null,20.833333333333343]
["21:00:00",2.5000000000000001E-2,2.5000000000000001E-2,0.1,null,null,21.000000000000011]
["21:10:00",2.4500000000000001E-2,2.4500000000000001E-2,0.1,null,null,21.166666666666679]
["21:20:00",2.4E-2,2.4E-2,0.1,null,null,21.333333333333346]
["21:30:00",2.4E-2,2.4E-2,0.1,null,null,21.500000000000014]
["21:40:00",2.35E-2,2.35E-2,{"$f":"D134","v":0.1},null,null,{"$f":"G134+1/6","v":21.666666666666682}]
["21:50:00",2.35E-2,2.35E-2,0.1,null,null,21.83333333333335]
["22:00:00",2.3E-2,2.3E-2,0.1,null,null,22.000000000000018]
["22:10:00",2.3E-2,2.3E-2,0.1,null,null,22.166666666666686]
["22:20:00",2.2499999999999999E-2,2.2499999999999999E-2,0.1,null,null,22.333333333333353]
["22:30:00",2.2499999999999999E-2,2.2499999999999999E-2,0.1,null,null,22.500000000000021]
["22:40:00",2.1999999999999999E-2,2.1999999999999999E-2,0.1,null,null,22.666666666666689]
["22:50:00",2.1999999999999999E-2,2.1999999999999999E-2,0.1,null,null,22.833333333333357]
["23:00:00",2.1499999999999998E-2,2.1499999999999998E-2,0.1,null,null,23.000000000000025]
["23:10:00",2.1499999999999998E-2,2.1499999999999998E-2,0.1,null,null,23.166666666666693]
["23:20:00",2.1000000000000001E-2,2.1000000000000001E-2,0.1,null,null,23.333333333333361]
["23:30:00",2.1000000000000001E-2,2.1000000000000001E-2,0.1,null,null,23.500000000000028]
["23:40:00",2.0500000000000001E-2,2.0500000000000001E-2,0.1,null,null,23.666666666666696]
["23:50:00",2.0500000000000001E-2,2.0500000000000001E-2,0.1,null,null,23.833333333333364]
[1,2.0500000000000001E-2,2.0500000000000001E-2,0.1,null,null,24.000000000000032]

{"sheet":"逐次計算（浸透考慮）","index":26,"n_rows":148,"n_cols":8,"rows_kept":148,"cut":false,"hidden":true,"merged":[]}
["時刻","行為後流入量","許容放流量","調整池水位","調節後放流量"]
[null,null,null,null,{"$f":"MAX(E3:E147)","v":0.41074364228740656}]
[{"$f":"runoff!A4","v":"00:00:00"},{"$f":"浸透計算!C5","v":0},{"$f":"runoff!$B$1","v":0.47543999999999997},0,0,null,null,0]
[{"$f":"runoff!A5","v":"00:10:00"},{"$f":"浸透計算!C6","v":2.0500000000000001E-2},{"$f":"runoff!$B$1","v":0.47543999999999997},0,0,null,null,{"$f":"H3+1/6","v":0.16666666666666666}]
[{"$f":"runoff!A6","v":"00:20:00"},{"$f":"浸透計算!C7","v":2.0500000000000001E-2},{"$f":"runoff!$B$1","v":0.47543999999999997},1.0901711566299658E-2,8.7691918066061969E-4,null,null,{"$f":"H4+1/6","v":0.33333333333333331}]
[{"$f":"runoff!A7","v":"00:30:00"},{"$f":"浸透計算!C8","v":2.1000000000000001E-2},{"$f":"runoff!$B$1","v":0.47543999999999997},3.0896141791898077E-2,4.1331064132622154E-3,null,null,0.5]
[{"$f":"runoff!A8","v":"00:40:00"},{"$f":"浸透計算!C9","v":2.1000000000000001E-2},{"$f":"runoff!$B$1","v":0.47543999999999997},4.7311527807090088E-2,7.8191987593921701E-3,null,null,0.66666666666666663]
[{"$f":"runoff!A9","v":"00:50:00"},{"$f":"浸透計算!C10","v":2.1499999999999998E-2},{"$f":"runoff!$B$1","v":0.47543999999999997},6.007397526417356E-2,1.1208395817857578E-2,null,null,0.83333333333333326]
[{"$f":"runoff!A10","v":"01:00:00"},{"$f":"浸透計算!C11","v":2.1499999999999998E-2},{"$f":"runoff!$B$1","v":0.47543999999999997},6.9672861983121379E-2,1.4013608088036341E-2,null,null,0.99999999999999989]
[{"$f":"runoff!A11","v":"01:10:00"},{"$f":"浸透計算!C12","v":2.1499999999999998E-2},{"$f":"runoff!$B$1","v":0.47543999999999997},7.6775236739201197E-2,1.6202117351019986E-2,null,null,1.1666666666666665]
[{"$f":"runoff!A12","v":"01:20:00"},{"$f":"浸透計算!C13","v":2.1999999999999999E-2},{"$f":"runoff!$B$1","v":0.47543999999999997},8.1767500336564353E-2,1.781180817372633E-2,null,null,1.3333333333333333]
[{"$f":"runoff!A13","v":"01:30:00"},{"$f":"浸透計算!C14","v":2.1999999999999999E-2},{"$f":"runoff!$B$1","v":0.47543999999999997},8.5471264160382476E-2,1.9021416943401027E-2,null,null,1.5]
[{"$f":"runoff!A14","v":"01:40:00"},{"$f":"浸透計算!C15","v":2.2499999999999999E-2},{"$f":"runoff!$B$1","v":0.47543999999999997},8.8255721321275973E-2,1.9966560166990697E-2,null,null,1.6666666666666667]
[{"$f":"runoff!A15","v":"01:50:00"},{"$f":"浸透計算!C16","v":2.2499999999999999E-2},{"$f":"runoff!$B$1","v":0.47543999999999997},9.0376065021954693E-2,2.0716821171787605E-2,null,null,1.8333333333333335]
[{"$f":"runoff!A16","v":"02:00:00"},{"$f":"浸透計算!C17","v":2.3E-2},{"$f":"runoff!$B$1","v":0.47543999999999997},9.2053172777377054E-2,2.126438486845213E-2,null,null,2]
[{"$f":"runoff!A17","v":"02:10:00"},{"$f":"浸透計算!C18","v":2.3E-2},{"$f":"runoff!$B$1","v":0.47543999999999997},9.3420716096620032E-2,2.1774037156910515E-2,null,null,2.1666666666666665]
[{"$f":"runoff!A18","v":"02:20:00"},{"$f":"浸透計算!C19","v":2.35E-2},{"$f":"runoff!$B$1","v":0.47543999999999997},9.4569079766973346E-2,2.2158908236453504E-2,null,null,2.333333333333333]
[{"$f":"runoff!A19","v":"02:30:00"},{"$f":"浸透計算!C20","v":2.4E-2},{"$f":"runoff!$B$1","v":0.47543999999999997},9.5590298619546765E-2,2.2502897828914341E-2,null,null,2.4999999999999996]
[{"$f":"runoff!A20","v":"02:40:00"},{"$f":"浸透計算!C21","v":2.4E-2},{"$f":"runoff!$B$1","v":0.47543999999999997},9.6735710206453038E-2,2.2935361314654363E-2,null,null,2.6666666666666661]
[{"$f":"runoff!A21","v":"02:50:00"},{"$f":"浸透計算!C22","v":2.4500000000000001E-2},{"$f":"runoff!$B$1","v":0.47543999999999997},9.7725341457241724E-2,2.3283302433926026E-2,null,null,2.8333333333333326]
[{"$f":"runoff!A22","v":"03:00:00"},{"$f":"浸透計算!C23","v":2.4500000000000001E-2},{"$f":"runoff!$B$1","v":0.47543999999999997},9.8629517820126703E-2,2.3589180112880997E-2,null,null,2.9999999999999991]
[{"$f":"runoff!A23","v":"03:10:00"},{"$f":"浸透計算!C24","v":2.5000000000000001E-2},{"$f":"runoff!$B$1","v":0.47543999999999997},9.9470870177788995E-2,2.3896385643326884E-2,null,null,3.1666666666666656]
[{"$f":"runoff!A24","v":"03:20:00"},{"$f":"浸透計算!C25","v":2.5499999999999998E-2},{"$f":"runoff!$B$1","v":0.47543999999999997},0.10027245748878497,2.4160757196880364E-2,null,null,3.3333333333333321]
[{"$f":"runoff!A25","v":"03:30:00"},{"$f":"浸透計算!C26","v":2.5499999999999998E-2},{"$f":"runoff!$B$1","v":0.47543999999999997},0.10128606045023085,2.4514757472517038E-2,null,null,3.4999999999999987]
[{"$f":"runoff!A26","v":"03:40:00"},{"$f":"浸透計算!C27","v":2.5999999999999999E-2},{"$f":"runoff!$B$1","v":0.47543999999999997},0.10218315631052445,2.4870469978954472E-2,null,null,3.6666666666666652]
[{"$f":"runoff!A27","v":"03:50:00"},{"$f":"浸透計算!C28","v":2.6499999999999999E-2},{"$f":"runoff!$B$1","v":0.47543999999999997},0.10298671935819036,2.5183116535246908E-2,null,null,3.8333333333333317]
[{"$f":"runoff!A28","v":"04:00:00"},{"$f":"浸透計算!C29","v":2.6499999999999999E-2},{"$f":"runoff!$B$1","v":0.47543999999999997},0.10397275602866851,2.5542017457892401E-2,null,null,3.9999999999999982]
[{"$f":"runoff!A29","v":"04:10:00"},{"$f":"浸透計算!C30","v":2.7E-2},{"$f":"runoff!$B$1","v":0.47543999999999997},0.10486194549024073,2.5857441511277598E-2,null,null,4.1666666666666652]
[{"$f":"runoff!A30","v":"04:20:00"},{"$f":"浸透計算!C31","v":2.75E-2},{"$f":"runoff!$B$1","v":0.47543999999999997},0.10567772609832918,2.617415339416319E-2,null,null,4.3333333333333321]
[{"$f":"runoff!A31","v":"04:30:00"},{"$f":"浸透計算!C32","v":2.8000000000000001E-2},{"$f":"runoff!$B$1","v":0.47543999999999997},0.10667115194697116,2.6537680078281244E-2,null,null,4.4999999999999991]
[{"$f":"runoff!A32","v":"04:40:00"},{"$f":"浸透計算!C33","v":2.8500000000000001E-2},{"$f":"runoff!$B$1","v":0.47543999999999997},0.10778986274550301,2.6948640484361432E-2,null,null,4.6666666666666661]
[{"$f":"runoff!A33","v":"04:50:00"},{"$f":"浸透計算!C34","v":2.9000000000000001E-2},{"$f":"runoff!$B$1","v":0.47543999999999997},0.10898077061671257,2.7407725347461352E-2,null,null,4.833333333333333]
[{"$f":"runoff!A34","v":"05:00:00"},{"$f":"浸透計算!C35","v":2.9499999999999998E-2},{"$f":"runoff!$B$1","v":0.47543999999999997},0.11021570768776887,2.7869387924637324E-2,null,null,5]
[{"$f":"runoff!A35","v":"05:10:00"},{"$f":"浸透計算!C36","v":0.03},{"$f":"runoff!$B$1","v":0.47543999999999997},0.11149181778371818,2.8333613902653917E-2,null,null,5.166666666666667]
[{"$f":"runoff!A36","v":"05:20:00"},{"$f":"浸透計算!C37","v":3.0499999999999999E-2},{"$f":"runoff!$B$1","v":0.47543999999999997},0.11278025094228612,2.8847206411923794E-2,null,null,5.3333333333333339]
[{"$f":"runoff!A37","v":"05:30:00"},{"$f":"浸透計算!C38","v":3.1E-2},{"$f":"runoff!$B$1","v":0.47543999999999997},0.11407804183381166,2.9316769983330253E-2,null,null,5.5000000000000009]
[{"$f":"runoff!A38","v":"05:40:00"},{"$f":"浸透計算!C39","v":3.15E-2},{"$f":"runoff!$B$1","v":0.47543999999999997},0.1153819470806064,2.9836200572439207E-2,null,null,5.6666666666666679]
[{"$f":"runoff!A39","v":"05:50:00"},{"$f":"浸透計算!C40","v":3.2000000000000001E-2},{"$f":"runoff!$B$1","v":0.47543999999999997},0.11666257833556301,3.0358663168638906E-2,null,null,5.8333333333333348]
[{"$f":"runoff!A40","v":"06:00:00"},{"$f":"浸透計算!C41","v":3.2500000000000001E-2},{"$f":"runoff!$B$1","v":0.47543999999999997},0.11794318462036177,3.0836245518723316E-2,null,null,6.0000000000000018]
[{"$f":"runoff!A41","v":"06:10:00"},{"$f":"浸透計算!C42","v":3.3000000000000002E-2},{"$f":"runoff!$B$1","v":0.47543999999999997},0.11922057701878545,3.1364448164114031E-2,null,null,6.1666666666666687]
[{"$f":"runoff!A42","v":"06:20:00"},{"$f":"浸透計算!C43","v":3.4000000000000002E-2},{"$f":"runoff!$B$1","v":0.47543999999999997},0.12049187222815358,3.1847220459023336E-2,null,null,6.3333333333333357]
[{"$f":"runoff!A43","v":"06:30:00"},{"$f":"浸透計算!C44","v":3.4500000000000003E-2},{"$f":"runoff!$B$1","v":0.47543999999999997},0.12200464829435152,3.2429782621820356E-2,null,null,6.5000000000000027]
[{"$f":"runoff!A44","v":"06:40:00"},{"$f":"浸透計算!C45","v":3.5499999999999997E-2},{"$f":"runoff!$B$1","v":0.47543999999999997},0.12364706207219139,3.3113872578067874E-2,null,null,6.6666666666666696]
[{"$f":"runoff!A45","v":"06:50:00"},{"$f":"浸透計算!C46","v":3.5999999999999997E-2},{"$f":"runoff!$B$1","v":0.47543999999999997},0.12536007386501793,3.3802706194844379E-2,null,null,6.8333333333333366]
[{"$f":"runoff!A46","v":"07:00:00"},{"$f":"浸透計算!C47","v":3.6999999999999998E-2},{"$f":"runoff!$B$1","v":0.47543999999999997},0.12713843096397226,3.4496251027037815E-2,null,null,7.0000000000000036]
[{"$f":"runoff!A47","v":"07:10:00"},{"$f":"浸透計算!C48","v":3.7999999999999999E-2},{"$f":"runoff!$B$1","v":0.47543999999999997},0.12894911001535173,3.5244526680479109E-2,null,null,7.1666666666666705]
[{"$f":"runoff!A48","v":"07:20:00"},{"$f":"浸透計算!C49","v":3.85E-2},{"$f":"runoff!$B$1","v":0.47543999999999997},0.13098047407131158,3.6099018018793144E-2,null,null,7.3333333333333375]
[{"$f":"runoff!A49","v":"07:30:00"},{"$f":"浸透計算!C50","v":3.95E-2},{"$f":"runoff!$B$1","v":0.47543999999999997},0.13292021164316445,3.6909454351871714E-2,null,null,7.5000000000000044]
[{"$f":"runoff!A50","v":"07:40:00"},{"$f":"浸透計算!C51","v":4.1000000000000002E-2},{"$f":"runoff!$B$1","v":0.47543999999999997},0.13478947789920581,3.772586638725383E-2,null,null,7.6666666666666714]
[{"$f":"runoff!A51","v":"07:50:00"},{"$f":"浸透計算!C52","v":4.2000000000000003E-2},{"$f":"runoff!$B$1","v":0.47543999999999997},0.13707987505714334,3.8651418728458641E-2,null,null,7.8333333333333384]
[{"$f":"runoff!A52","v":"08:00:00"},{"$f":"浸透計算!C53","v":4.2999999999999997E-2},{"$f":"runoff!$B$1","v":0.47543999999999997},0.13963984319053679,3.9740638631433095E-2,null,null,8.0000000000000053]
[{"$f":"runoff!A53","v":"08:10:00"},{"$f":"浸透計算!C54","v":4.4499999999999998E-2},{"$f":"runoff!$B$1","v":0.47543999999999997},0.14212430511187599,4.078732991015635E-2,null,null,8.1666666666666714]
[{"$f":"runoff!A54","v":"08:20:00"},{"$f":"浸透計算!C55","v":4.5499999999999999E-2},{"$f":"runoff!$B$1","v":0.47543999999999997},0.14477072268317737,4.1949118461501185E-2,null,null,8.3333333333333375]
[{"$f":"runoff!A55","v":"08:30:00"},{"$f":"浸透計算!C56","v":4.7E-2},{"$f":"runoff!$B$1","v":0.47543999999999997},0.14750913851132252,4.3121733047837521E-2,null,null,8.5000000000000036]
[{"$f":"runoff!A56","v":"08:40:00"},{"$f":"浸透計算!C57","v":4.9000000000000002E-2},{"$f":"runoff!$B$1","v":0.47543999999999997},0.15029755560387406,4.4359116185569709E-2,null,null,8.6666666666666696]
[{"$f":"runoff!A57","v":"08:50:00"},{"$f":"浸透計算!C58","v":5.0500000000000003E-2},{"$f":"runoff!$B$1","v":0.47543999999999997},0.153527764281921,4.582650819394582E-2,null,null,8.8333333333333357]
[{"$f":"runoff!A58","v":"09:00:00"},{"$f":"浸透計算!C59","v":5.2499999999999998E-2},{"$f":"runoff!$B$1","v":0.47543999999999997},0.15703249912975259,4.7364969079957311E-2,null,null,9.0000000000000018]
[{"$f":"runoff!A59","v":"09:10:00"},{"$f":"浸透計算!C60","v":5.45E-2},{"$f":"runoff!$B$1","v":0.47543999999999997},0.16070084770761564,4.9032003479889279E-2,null,null,9.1666666666666679]
[{"$f":"runoff!A60","v":"09:20:00"},{"$f":"浸透計算!C61","v":5.7000000000000002E-2},{"$f":"runoff!$B$1","v":0.47543999999999997},0.16463428669990113,5.0887806333996817E-2,null,null,9.3333333333333339]
[{"$f":"runoff!A61","v":"09:30:00"},{"$f":"浸透計算!C62","v":5.9499999999999997E-2},{"$f":"runoff!$B$1","v":0.47543999999999997},0.16892937527000565,5.2881034239815036E-2,null,null,9.5]
[{"$f":"runoff!A62","v":"09:40:00"},{"$f":"浸透計算!C63","v":6.25E-2},{"$f":"runoff!$B$1","v":0.47543999999999997},0.17367667853918542,5.5073819875661421E-2,null,null,9.6666666666666661]
[{"$f":"runoff!A63","v":"09:50:00"},{"$f":"浸透計算!C64","v":6.5500000000000003E-2},{"$f":"runoff!$B$1","v":0.47543999999999997},0.17886306485918685,5.7590684748336021E-2,null,null,9.8333333333333321]
[{"$f":"runoff!A64","v":"10:00:00"},{"$f":"浸透計算!C65","v":6.9500000000000006E-2},{"$f":"runoff!$B$1","v":0.47543999999999997},0.18446583485252904,6.0324329263648009E-2,null,null,9.9999999999999982]
[{"$f":"runoff!A65","v":"10:10:00"},{"$f":"浸透計算!C66","v":7.3499999999999996E-2},{"$f":"runoff!$B$1","v":0.47543999999999997},0.19072781800300545,6.3404101065494448E-2,null,null,10.166666666666664]
[{"$f":"runoff!A66","v":"10:20:00"},{"$f":"浸透計算!C67","v":7.85E-2},{"$f":"runoff!$B$1","v":0.47543999999999997},0.19774323190364801,6.6968153913348941E-2,null,null,10.33333333333333]
[{"$f":"runoff!A67","v":"10:30:00"},{"$f":"浸透計算!C68","v":8.4500000000000006E-2},{"$f":"runoff!$B$1","v":0.47543999999999997},0.20555226990730813,7.0975577680062837E-2,null,null,10.499999999999996]
[{"$f":"runoff!A68","v":"10:40:00"},{"$f":"浸透計算!C69","v":9.1499999999999998E-2},{"$f":"runoff!$B$1","v":0.47543999999999997},0.21461865945549674,7.5704921133197683E-2,null,null,10.666666666666663]
[{"$f":"runoff!A69","v":"10:50:00"},{"$f":"浸透計算!C70","v":0.1},{"$f":"runoff!$B$1","v":0.47543999999999997},0.22515622844753849,8.1327454681127134E-2,null,null,10.833333333333329]
[{"$f":"runoff!A70","v":"11:00:00"},{"$f":"浸透計算!C71","v":0.111},{"$f":"runoff!$B$1","v":0.47543999999999997},0.23741883191302737,8.8099859080992882E-2,null,null,{"$f":"H68+1/6","v":10.999999999999995}]
[{"$f":"runoff!A71","v":"11:10:00"},{"$f":"浸透計算!C72","v":0.1255},{"$f":"runoff!$B$1","v":0.47543999999999997},0.25215360374935825,9.637755161361157E-2,null,null,11.166666666666661]
[{"$f":"runoff!A72","v":"11:20:00"},{"$f":"浸透計算!C73","v":0.14499999999999999},{"$f":"runoff!$B$1","v":0.47543999999999997},0.27047735102237375,0.10713970329496048,null,null,11.333333333333327]
[{"$f":"runoff!A73","v":"11:30:00"},{"$f":"浸透計算!C74","v":0.17399999999999999},{"$f":"runoff!$B$1","v":0.47543999999999997},0.29385207397235874,0.12128579539506652,null,null,11.499999999999993]
[{"$f":"runoff!A74","v":"11:40:00"},{"$f":"浸透計算!C75","v":0.2225},{"$f":"runoff!$B$1","v":0.47543999999999997},0.3252375754019271,0.14122030203171043,null,null,11.666666666666659]
[{"$f":"runoff!A75","v":"11:50:00"},{"$f":"浸透計算!C76","v":0.32250000000000001},{"$f":"runoff!$B$1","v":0.47543999999999997},0.37132653150628681,0.17231957698044204,null,null,11.833333333333325]
[{"$f":"runoff!A76","v":"12:00:00"},{"$f":"浸透計算!C77","v":0.77800000000000002},{"$f":"runoff!$B$1","v":0.47543999999999997},0.45047347715144764,0.23021592085826856,null,null,11.999999999999991]
[{"$f":"runoff!A77","v":"12:10:00"},{"$f":"浸透計算!C78","v":0.435},{"$f":"runoff!$B$1","v":0.47543999999999997},0.73653541817669077,0.35537258529629379,null,null,12.166666666666657]
[{"$f":"runoff!A78","v":"12:20:00"},{"$f":"浸透計算!C79","v":0.26150000000000001},{"$f":"runoff!$B$1","v":0.47543999999999997},0.98480418063019048,0.41074364228740656,null,null,12.333333333333323]
[{"$f":"runoff!A79","v":"12:30:00"},{"$f":"浸透計算!C80","v":0.19450000000000001},{"$f":"runoff!$B$1","v":0.47543999999999997},0.92474039264935037,0.39387117607810551,null,null,12.499999999999989]
[{"$f":"runoff!A80","v":"12:40:00"},{"$f":"浸透計算!C81","v":0.158},{"$f":"runoff!$B$1","v":0.47543999999999997},0.75981888443229739,0.35898753871258976,null,null,12.666666666666655]
[{"$f":"runoff!A81","v":"12:50:00"},{"$f":"浸透計算!C82","v":0.13450000000000001},{"$f":"runoff!$B$1","v":0.47543999999999997},0.57294933477191379,0.32987765067610081,null,null,12.833333333333321]
[{"$f":"runoff!A82","v":"13:00:00"},{"$f":"浸透計算!C83","v":0.11799999999999999},{"$f":"runoff!$B$1","v":0.47543999999999997},0.43205600163787444,0.21623034896517002,null,null,12.999999999999988]
[{"$f":"runoff!A83","v":"13:10:00"},{"$f":"浸透計算!C84","v":0.1055},{"$f":"runoff!$B$1","v":0.47543999999999997},0.3605966191512982,0.16489653951066727,null,null,13.166666666666654]
[{"$f":"runoff!A84","v":"13:20:00"},{"$f":"浸透計算!C85","v":9.5500000000000002E-2},{"$f":"runoff!$B$1","v":0.47543999999999997},0.31746491228117385,0.13624053285555651,null,null,13.33333333333332]
[{"$f":"runoff!A85","v":"13:30:00"},{"$f":"浸透計算!C86","v":8.7999999999999995E-2},{"$f":"runoff!$B$1","v":0.47543999999999997},0.28802529145860728,0.11775078462506336,null,null,13.499999999999986]
[{"$f":"runoff!A86","v":"13:40:00"},{"$f":"浸透計算!C87","v":8.1500000000000003E-2},{"$f":"runoff!$B$1","v":0.47543999999999997},0.26639517482412522,0.10468342531700434,null,null,13.666666666666652]
[{"$f":"runoff!A87","v":"13:50:00"},{"$f":"浸透計算!C88","v":7.5999999999999998E-2},{"$f":"runoff!$B$1","v":0.47543999999999997},0.24963727787875462,9.4980789184662781E-2,null,null,13.833333333333318]
[{"$f":"runoff!A88","v":"14:00:00"},{"$f":"浸透計算!C89","v":7.1499999999999994E-2},{"$f":"runoff!$B$1","v":0.47543999999999997},0.23591568763700296,8.7218073250490177E-2,null,null,13.999999999999984]
[{"$f":"runoff!A89","v":"14:10:00"},{"$f":"浸透計算!C90","v":6.7500000000000004E-2},{"$f":"runoff!$B$1","v":0.47543999999999997},0.22444406732527114,8.0930843310627137E-2,null,null,14.16666666666665]
[{"$f":"runoff!A90","v":"14:20:00"},{"$f":"浸透計算!C91","v":6.4000000000000001E-2},{"$f":"runoff!$B$1","v":0.47543999999999997},0.21464642041203513,7.5704921133197683E-2,null,null,14.333333333333316]
[{"$f":"runoff!A91","v":"14:30:00"},{"$f":"浸透計算!C92","v":6.0999999999999999E-2},{"$f":"runoff!$B$1","v":0.47543999999999997},0.2060722365080716,7.1228609893936645E-2,null,null,14.499999999999982]
[{"$f":"runoff!A92","v":"14:40:00"},{"$f":"浸透計算!C93","v":5.8000000000000003E-2},{"$f":"runoff!$B$1","v":0.47543999999999997},0.19853381796315964,6.7340543486904866E-2,null,null,14.666666666666648]
[{"$f":"runoff!A93","v":"14:50:00"},{"$f":"浸透計算!C94","v":5.6000000000000001E-2},{"$f":"runoff!$B$1","v":0.47543999999999997},0.19173805847661093,6.3891823588882804E-2,null,null,14.833333333333314]
[{"$f":"runoff!A94","v":"15:00:00"},{"$f":"浸透計算!C95","v":5.3499999999999999E-2},{"$f":"runoff!$B$1","v":0.47543999999999997},0.18569578782161184,6.0984263590115557E-2,null,null,14.99999999999998]
[{"$f":"runoff!A95","v":"15:10:00"},{"$f":"浸透計算!C96","v":5.1499999999999997E-2},{"$f":"runoff!$B$1","v":0.47543999999999997},0.18026023547093978,5.8299730641094151E-2,null,null,15.166666666666647]
[{"$f":"runoff!A96","v":"15:20:00"},{"$f":"浸透計算!C97","v":4.9500000000000002E-2},{"$f":"runoff!$B$1","v":0.47543999999999997},0.17518773230702872,5.5830775053945729E-2,null,null,15.333333333333313]
[{"$f":"runoff!A97","v":"15:30:00"},{"$f":"浸透計算!C98","v":4.8000000000000001E-2},{"$f":"runoff!$B$1","v":0.47543999999999997},0.17048849421378393,5.3627853513894881E-2,null,null,15.499999999999979]
[{"$f":"runoff!A98","v":"15:40:00"},{"$f":"浸透計算!C99","v":4.65E-2},{"$f":"runoff!$B$1","v":0.47543999999999997},0.16618126078858431,5.1625166651464445E-2,null,null,15.666666666666645]
[{"$f":"runoff!A99","v":"15:50:00"},{"$f":"浸透計算!C100","v":4.4999999999999998E-2},{"$f":"runoff!$B$1","v":0.47543999999999997},0.1623247758091495,4.9816506311518204E-2,null,null,15.833333333333311]
[{"$f":"runoff!A100","v":"16:00:00"},{"$f":"浸透計算!C101","v":4.3499999999999997E-2},{"$f":"runoff!$B$1","v":0.47543999999999997},0.15873753548251382,4.8140526276426031E-2,null,null,15.999999999999977]
[{"$f":"runoff!A101","v":"16:10:00"},{"$f":"浸透計算!C102","v":4.2500000000000003E-2},{"$f":"runoff!$B$1","v":0.47543999999999997},0.15527411976392042,4.6593622017042119E-2,null,null,16.166666666666643]
[{"$f":"runoff!A102","v":"16:20:00"},{"$f":"浸透計算!C103","v":4.1500000000000002E-2},{"$f":"runoff!$B$1","v":0.47543999999999997},0.15207079132717943,4.5172369169091633E-2,null,null,16.333333333333311]
[{"$f":"runoff!A103","v":"16:30:00"},{"$f":"浸透計算!C104","v":0.04},{"$f":"runoff!$B$1","v":0.47543999999999997},0.14926751201298266,4.3873533596462573E-2,null,null,16.499999999999979]
[{"$f":"runoff!A104","v":"16:40:00"},{"$f":"浸透計算!C105","v":3.9E-2},{"$f":"runoff!$B$1","v":0.47543999999999997},0.14645217031831731,4.2694081453935058E-2,null,null,16.666666666666647]
[{"$f":"runoff!A105","v":"16:50:00"},{"$f":"浸透計算!C106","v":3.85E-2},{"$f":"runoff!$B$1","v":0.47543999999999997},0.14361118915985419,4.1419684631298581E-2,null,null,16.833333333333314]
[{"$f":"runoff!A106","v":"17:00:00"},{"$f":"浸透計算!C107","v":3.7499999999999999E-2},{"$f":"runoff!$B$1","v":0.47543999999999997},0.14120027732272278,4.0419956675537973E-2,null,null,16.999999999999982]
[{"$f":"runoff!A107","v":"17:10:00"},{"$f":"浸透計算!C108","v":3.6499999999999998E-2},{"$f":"runoff!$B$1","v":0.47543999999999997},0.1390334202176261,3.9480386113636065E-2,null,null,17.16666666666665]
[{"$f":"runoff!A108","v":"17:20:00"},{"$f":"浸透計算!C109","v":3.5499999999999997E-2},{"$f":"runoff!$B$1","v":0.47543999999999997},0.13679531087567121,3.8548210701882794E-2,null,null,17.333333333333318]
[{"$f":"runoff!A109","v":"17:30:00"},{"$f":"浸透計算!C110","v":3.5000000000000003E-2},{"$f":"runoff!$B$1","v":0.47543999999999997},0.13450611828491832,3.7572335961472379E-2,null,null,17.499999999999986]
[{"$f":"runoff!A110","v":"17:40:00"},{"$f":"浸透計算!C111","v":3.4000000000000002E-2},{"$f":"runoff!$B$1","v":0.47543999999999997},0.132406885345596,3.6706283329307796E-2,null,null,17.666666666666654]
[{"$f":"runoff!A111","v":"17:50:00"},{"$f":"浸透計算!C112","v":3.3500000000000002E-2},{"$f":"runoff!$B$1","v":0.47543999999999997},0.13043284508434996,3.5846989140935093E-2,null,null,17.833333333333321]
[{"$f":"runoff!A112","v":"18:00:00"},{"$f":"浸透計算!C113","v":3.3000000000000002E-2},{"$f":"runoff!$B$1","v":0.47543999999999997},0.12852093797521125,3.5094443655514576E-2,null,null,17.999999999999989]
[{"$f":"runoff!A113","v":"18:10:00"},{"$f":"浸透計算!C114","v":3.2500000000000001E-2},{"$f":"runoff!$B$1","v":0.47543999999999997},0.12685908818665473,3.439688596388718E-2,null,null,18.166666666666657]
[{"$f":"runoff!A114","v":"18:20:00"},{"$f":"浸透計算!C115","v":3.15E-2},{"$f":"runoff!$B$1","v":0.47543999999999997},0.1253593147651372,3.3802706194844379E-2,null,null,18.333333333333325]
[{"$f":"runoff!A115","v":"18:30:00"},{"$f":"浸透計算!C116","v":3.1E-2},{"$f":"runoff!$B$1","v":0.47543999999999997},0.12371174573905687,3.3162918052100213E-2,null,null,18.499999999999993]
[{"$f":"runoff!A116","v":"18:40:00"},{"$f":"浸透計算!C117","v":3.0499999999999999E-2},{"$f":"runoff!$B$1","v":0.47543999999999997},0.12199357869798988,3.2429782621820356E-2,null,null,18.666666666666661]
[{"$f":"runoff!A117","v":"18:50:00"},{"$f":"浸透計算!C118","v":0.03},{"$f":"runoff!$B$1","v":0.47543999999999997},0.12045079920863229,3.1847220459023336E-2,null,null,18.833333333333329]
[{"$f":"runoff!A118","v":"19:00:00"},{"$f":"浸透計算!C119","v":2.9499999999999998E-2},{"$f":"runoff!$B$1","v":0.47543999999999997},0.11899779393683993,3.1268189030202925E-2,null,null,18.999999999999996]
[{"$f":"runoff!A119","v":"19:10:00"},{"$f":"浸透計算!C120","v":2.9000000000000001E-2},{"$f":"runoff!$B$1","v":0.47543999999999997},0.11760406093901912,3.0740530365874499E-2,null,null,19.166666666666664]
[{"$f":"runoff!A120","v":"19:20:00"},{"$f":"浸透計算!C121","v":2.8500000000000001E-2},{"$f":"runoff!$B$1","v":0.47543999999999997},0.11626580680803077,3.0168327069904546E-2,null,null,19.333333333333332]
[{"$f":"runoff!A121","v":"19:30:00"},{"$f":"浸透計算!C122","v":2.8000000000000001E-2},{"$f":"runoff!$B$1","v":0.47543999999999997},0.11495327163240165,2.9694236246227832E-2,null,null,19.5]
[{"$f":"runoff!A122","v":"19:40:00"},{"$f":"浸透計算!C123","v":2.75E-2},{"$f":"runoff!$B$1","v":0.47543999999999997},0.1136366761374413,2.9175635644700829E-2,null,null,19.666666666666668]
[{"$f":"runoff!A123","v":"19:50:00"},{"$f":"浸透計算!C124","v":2.75E-2},{"$f":"runoff!$B$1","v":0.47543999999999997},0.11233905091092446,2.8660089763029487E-2,null,null,19.833333333333336]
[{"$f":"runoff!A124","v":"20:00:00"},{"$f":"浸透計算!C125","v":2.7E-2},{"$f":"runoff!$B$1","v":0.47543999999999997},0.11125729195655278,2.8287076354839544E-2,null,null,20.000000000000004]
[{"$f":"runoff!A125","v":"20:10:00"},{"$f":"浸透計算!C126","v":2.6499999999999999E-2},{"$f":"runoff!$B$1","v":0.47543999999999997},0.11031130764636121,2.7915695403505286E-2,null,null,20.166666666666671]
[{"$f":"runoff!A126","v":"20:20:00"},{"$f":"浸透計算!C127","v":2.5999999999999999E-2},{"$f":"runoff!$B$1","v":0.47543999999999997},0.10924711458483456,2.7499852107242692E-2,null,null,20.333333333333339]
[{"$f":"runoff!A127","v":"20:30:00"},{"$f":"浸透計算!C128","v":2.5999999999999999E-2},{"$f":"runoff!$B$1","v":0.47543999999999997},0.10808825540191712,2.708609442200868E-2,null,null,20.500000000000007]
[{"$f":"runoff!A128","v":"20:40:00"},{"$f":"浸透計算!C129","v":2.5499999999999998E-2},{"$f":"runoff!$B$1","v":0.47543999999999997},0.10708483114825081,2.672006923459069E-2,null,null,20.666666666666675]
[{"$f":"runoff!A129","v":"20:50:00"},{"$f":"浸透計算!C130","v":2.5000000000000001E-2},{"$f":"runoff!$B$1","v":0.47543999999999997},0.10620939945548903,2.6355707812380499E-2,null,null,20.833333333333343]
[{"$f":"runoff!A130","v":"21:00:00"},{"$f":"浸透計算!C131","v":2.5000000000000001E-2},{"$f":"runoff!$B$1","v":0.47543999999999997},0.1051823296777616,2.599301778752889E-2,null,null,21.000000000000011]
[{"$f":"runoff!A131","v":"21:10:00"},{"$f":"浸透計算!C132","v":2.4500000000000001E-2},{"$f":"runoff!$B$1","v":0.47543999999999997},0.10427953818569365,2.5632006898193449E-2,null,null,21.166666666666679]
[{"$f":"runoff!A132","v":"21:20:00"},{"$f":"浸透計算!C133","v":2.4E-2},{"$f":"runoff!$B$1","v":0.47543999999999997},0.10344933692004776,2.5362355379969136E-2,null,null,21.333333333333346]
[{"$f":"runoff!A133","v":"21:30:00"},{"$f":"浸透計算!C134","v":2.4E-2},{"$f":"runoff!$B$1","v":0.47543999999999997},0.10243710355461809,2.4959664677804277E-2,null,null,21.500000000000014]
[{"$f":"runoff!A134","v":"21:40:00"},{"$f":"浸透計算!C135","v":2.35E-2},{"$f":"runoff!$B$1","v":0.47543999999999997},0.10154398459276565,2.4647949453530126E-2,null,null,{"$f":"H132+1/6","v":21.666666666666682}]
[{"$f":"runoff!A135","v":"21:50:00"},{"$f":"浸透計算!C136","v":2.35E-2},{"$f":"runoff!$B$1","v":0.47543999999999997},0.10071871112494239,2.4337542788551735E-2,null,null,21.83333333333335]
[{"$f":"runoff!A136","v":"22:00:00"},{"$f":"浸透計算!C137","v":2.3E-2},{"$f":"runoff!$B$1","v":0.47543999999999997},9.9935339777627211E-2,2.4072525636615584E-2,null,null,22.000000000000018]
[{"$f":"runoff!A137","v":"22:10:00"},{"$f":"浸透計算!C138","v":2.3E-2},{"$f":"runoff!$B$1","v":0.47543999999999997},9.9192512254806922E-2,2.376456390446096E-2,null,null,22.166666666666686]
[{"$f":"runoff!A138","v":"22:20:00"},{"$f":"浸透計算!C139","v":2.2499999999999999E-2},{"$f":"runoff!$B$1","v":0.47543999999999997},9.8464753491020504E-2,2.3545401870354588E-2,null,null,22.333333333333353]
[{"$f":"runoff!A139","v":"22:30:00"},{"$f":"浸透計算!C140","v":2.2499999999999999E-2},{"$f":"runoff!$B$1","v":0.47543999999999997},9.7750800032309515E-2,2.3239714355325212E-2,null,null,22.500000000000021]
[{"$f":"runoff!A140","v":"22:40:00"},{"$f":"浸透計算!C141","v":2.1999999999999999E-2},{"$f":"runoff!$B$1","v":0.47543999999999997},9.7049746049245003E-2,2.3022182814190911E-2,null,null,22.666666666666689]
[{"$f":"runoff!A141","v":"22:50:00"},{"$f":"浸透計算!C142","v":2.1999999999999999E-2},{"$f":"runoff!$B$1","v":0.47543999999999997},9.6336285207098415E-2,2.2762046701672922E-2,null,null,22.833333333333357]
[{"$f":"runoff!A142","v":"23:00:00"},{"$f":"浸透計算!C143","v":2.1499999999999998E-2},{"$f":"runoff!$B$1","v":0.47543999999999997},9.5609581156331988E-2,2.2546020589706648E-2,null,null,23.000000000000025]
[{"$f":"runoff!A143","v":"23:10:00"},{"$f":"浸透計算!C144","v":2.1499999999999998E-2},{"$f":"runoff!$B$1","v":0.47543999999999997},9.4892491955784142E-2,2.2244739971279487E-2,null,null,23.166666666666693]
[{"$f":"runoff!A144","v":"23:20:00"},{"$f":"浸透計算!C145","v":2.1000000000000001E-2},{"$f":"runoff!$B$1","v":0.47543999999999997},9.4184098525857254E-2,2.2030368202588909E-2,null,null,23.333333333333361]
[{"$f":"runoff!A145","v":"23:30:00"},{"$f":"浸透計算!C146","v":2.1000000000000001E-2},{"$f":"runoff!$B$1","v":0.47543999999999997},9.3459428881690912E-2,2.1774037156910515E-2,null,null,23.500000000000028]
[{"$f":"runoff!A146","v":"23:40:00"},{"$f":"浸透計算!C147","v":2.0500000000000001E-2},{"$f":"runoff!$B$1","v":0.47543999999999997},9.2741237092808043E-2,2.1518708063078651E-2,null,null,23.666666666666696]
[{"$f":"runoff!A147","v":"23:50:00"},{"$f":"浸透計算!C148","v":2.0500000000000001E-2},{"$f":"runoff!$B$1","v":0.47543999999999997},9.2028407686402053E-2,2.126438486845213E-2,null,null,23.833333333333364]
[{"$f":"runoff!A148","v":1},{"$f":"浸透計算!C149","v":2.0500000000000001E-2},{"$f":"runoff!$B$1","v":0.47543999999999997},9.1319820777587102E-2,2.1011071567414781E-2,null,null,24.000000000000032]
[null,null,null,9.0845470418132693E-2,2.0842759079603149E-2]

{"sheet":"調節計算（自然調節方式）","index":27,"n_rows":151,"n_cols":8,"rows_kept":151,"cut":false,"hidden":true,"merged":[]}
[]
[null,null,null,null,{"$f":"MAX(E7:E151)","v":9.4422253028602465E-2}]
[]
[]
[]
["時刻","行為後流入量","浸透考慮後流入量","許容放流量","調節後放流量","調整池水位"]
["00:00:00",0,0,0.1,0,0,0,0]
["00:10:00",2.0500000000000001E-2,2.0500000000000001E-2,0.1,0,8.7857142857142856E-3,6.15,{"$f":"H7+1/6","v":0.16666666666666666}]
["00:20:00",2.0500000000000001E-2,2.0500000000000001E-2,0.1,1.4441101754939329E-3,2.5738238496216891E-2,18.016766947351822,{"$f":"H8+1/6","v":0.33333333333333331}]
["00:30:00",2.1000000000000001E-2,2.1000000000000001E-2,0.1,2.9669362421723758E-3,4.1633504317217039E-2,29.143453022051929,0.5]
["00:40:00",2.1000000000000001E-2,2.1000000000000001E-2,0.1,4.6636723730225111E-3,5.6363243482133521E-2,39.454270437493463,0.66666666666666663]
["00:50:00",2.1499999999999998E-2,2.1499999999999998E-2,0.1,6.4457089041874043E-3,6.9816365791900689E-2,48.871456054330487,0.83333333333333326]
["01:00:00",2.1499999999999998E-2,2.1499999999999998E-2,0.1,8.2078716157423914E-3,8.1964831283359352E-2,57.375381898351549,0.99999999999999989]
["01:10:00",2.1499999999999998E-2,2.1499999999999998E-2,0.1,9.8523381461428968E-3,9.2653312813979954E-2,64.857318969785965,1.1666666666666665]
["01:20:00",2.1999999999999999E-2,2.1999999999999999E-2,0.1,1.1409453223362896E-2,0.10218397365562032,71.528781558934227,1.3333333333333333]
["01:30:00",2.1999999999999999E-2,2.1999999999999999E-2,0.1,1.2870267566594963E-2,0.11063552188849551,77.444865321946864,1.5]
["01:40:00",2.2499999999999999E-2,2.2499999999999999E-2,0.1,1.4168254726832872E-2,0.11811901233416931,82.683308633918514,1.6666666666666667]
["01:50:00",2.2499999999999999E-2,2.2499999999999999E-2,0.1,1.5394053404923416E-2,0.12473516599198804,87.314616194391633,1.8333333333333335]
["02:00:00",2.3E-2,2.3E-2,0.1,1.649120201271773E-2,0.13057005652728471,91.399039569099287,2]
["02:10:00",2.3E-2,2.3E-2,0.1,1.747164617492622E-2,0.13572883587543727,95.010185112806099,2.1666666666666665]
["02:20:00",2.35E-2,2.35E-2,0.1,1.837483321274673E-2,0.14029463042357745,98.206241296504217,2.333333333333333]
["02:30:00",2.4E-2,2.4E-2,0.1,1.9195710820856735E-2,0.14455011155203309,101.18507808642318,2.4999999999999996]
["02:40:00",2.4E-2,2.4E-2,0.1,1.9954509738127249E-2,0.14834287416961139,103.84001191872798,2.6666666666666661]
["02:50:00",2.4500000000000001E-2,2.4500000000000001E-2,0.1,2.0648254199385822E-2,0.15172740391067724,106.20918273747407,2.8333333333333326]
["03:00:00",2.4500000000000001E-2,2.4500000000000001E-2,0.1,2.1274312066993661E-2,0.15476058979651461,108.33241285756023,2.9999999999999991]
["03:10:00",2.5000000000000001E-2,2.5000000000000001E-2,0.1,2.1830375733250969E-2,0.15750143788212406,110.25100651748684,3.1666666666666656]
["03:20:00",2.5499999999999998E-2,2.5499999999999998E-2,0.1,2.2391201475377254E-2,0.16019219050699768,112.13453335489838,3.3333333333333321]
["03:30:00",2.5499999999999998E-2,2.5499999999999998E-2,0.1,2.290514167877139E-2,0.16263661486950542,113.84563040865379,3.4999999999999987]
["03:40:00",2.5999999999999999E-2,2.5999999999999999E-2,0.1,2.3371000134997107E-2,0.16487541123503319,115.41278786452324,3.6666666666666652]
["03:50:00",2.6499999999999999E-2,2.6499999999999999E-2,0.1,2.386611985892453E-2,0.1671309312376382,116.99165186634674,3.8333333333333317]
["04:00:00",2.6499999999999999E-2,2.6499999999999999E-2,0.1,2.4312044981489454E-2,0.16919743202031792,118.43820241422254,3.9999999999999982]
["04:10:00",2.7E-2,2.7E-2,0.1,2.4734245417812141E-2,0.17110616470633153,119.77431529443207,4.1666666666666652]
["04:20:00",2.75E-2,2.75E-2,0.1,2.5158861912393918E-2,0.17308054727910038,121.15638309537026,4.3333333333333321]
["04:30:00",2.8000000000000001E-2,2.8000000000000001E-2,0.1,2.5585880795332586E-2,0.17511851469007472,122.5829602830523,4.4999999999999991]
["04:40:00",2.8500000000000001E-2,2.8500000000000001E-2,0.1,2.6069131917243537E-2,0.17719493781325638,124.03645646927947,4.6666666666666661]
["04:50:00",2.9000000000000001E-2,2.9000000000000001E-2,0.1,2.6528295032059689E-2,0.17929604054926929,125.5072283844885,4.833333333333333]
["05:00:00",2.9499999999999998E-2,2.9499999999999998E-2,0.1,2.7017371712014852E-2,0.18141932623038018,126.99352836126613,5]
["05:10:00",0.03,0.03,0.1,2.7482004067873194E-2,0.18356245089614243,128.49371562729971,5.166666666666667]
["05:20:00",3.0499999999999999E-2,3.0499999999999999E-2,0.1,2.7976837726888304E-2,0.18572294726981609,130.00606308887126,5.3333333333333339]
["05:30:00",3.1E-2,3.1E-2,0.1,2.8446875688734219E-2,0.18789849866312072,131.5289490641845,5.5000000000000009]
["05:40:00",3.15E-2,3.15E-2,0.1,2.8947400114251527E-2,0.19008666617612682,133.06066632328879,5.6666666666666679]
["05:50:00",3.2000000000000001E-2,3.2000000000000001E-2,0.1,2.9450826171155541E-2,0.19227314062523809,134.59119843766666,5.8333333333333348]
["06:00:00",3.2500000000000001E-2,3.2500000000000001E-2,0.1,2.9957137230501533E-2,0.19445544202452789,136.11880941716953,6.0000000000000018]
["06:10:00",3.3000000000000002E-2,3.3000000000000002E-2,0.1,3.0466316946008799E-2,0.19663110452030919,137.64177316421643,6.1666666666666687]
["06:20:00",3.4000000000000002E-2,3.4000000000000002E-2,0.1,3.100687880687612E-2,0.19899973491192993,139.29981443835095,6.3333333333333357]
["06:30:00",3.4500000000000003E-2,3.4500000000000003E-2,0.1,3.1608017350759417E-2,0.20152192227294327,141.06534559106029,6.5000000000000027]
["06:40:00",3.5499999999999997E-2,3.5499999999999997E-2,0.1,3.2241894800679662E-2,0.20415767420804085,142.91037194562858,6.6666666666666696]
["06:50:00",3.5999999999999997E-2,3.5999999999999997E-2,0.1,3.2879953826592125E-2,0.20689116765349577,144.82381735744704,6.8333333333333366]
["07:00:00",3.6999999999999998E-2,3.6999999999999998E-2,0.1,3.3551456992826238E-2,0.20970627730231647,146.79439411162153,7.0000000000000036]
["07:10:00",3.7999999999999999E-2,3.7999999999999999E-2,0.1,3.428646618508327E-2,0.21277573879749809,148.94301715824867,7.1666666666666705]
["07:20:00",3.85E-2,3.85E-2,0.1,3.5056487090764088E-2,0.21584304453642067,151.09013117549446,7.3333333333333375]
["07:30:00",3.95E-2,3.95E-2,0.1,3.5772317731470347E-2,0.21891641389832017,153.24148972882412,7.5000000000000044]
["07:40:00",4.1000000000000002E-2,4.1000000000000002E-2,0.1,3.6643690313386074E-2,0.222380981879096,155.6666873153672,7.6666666666666714]
["07:50:00",4.2000000000000003E-2,4.2000000000000003E-2,0.1,3.755243635170416E-2,0.22615407045120017,158.30784931584012,7.8333333333333384]
["08:00:00",4.2999999999999997E-2,4.2999999999999997E-2,0.1,3.8529909848799636E-2,0.22997592207955567,160.98314545568897,8.0000000000000053]
["08:10:00",4.4499999999999998E-2,4.4499999999999998E-2,0.1,3.9546660401341791E-2,0.23401453482949505,163.81017438064654,8.1666666666666714]
["08:20:00",4.5499999999999999E-2,4.5499999999999999E-2,0.1,4.0603413811467148E-2,0.23823593159543408,166.76515211680385,8.3333333333333375]
["08:30:00",4.7E-2,4.7E-2,0.1,4.1732408115350617E-2,0.24259200791251215,169.81440553875851,8.5000000000000036]
["08:40:00",4.9000000000000002E-2,4.9000000000000002E-2,0.1,4.2998892340668414E-2,0.24742145057421827,173.19501540195279,8.6666666666666696]
["08:50:00",5.0500000000000003E-2,5.0500000000000003E-2,0.1,4.434221477599614E-2,0.25263240466707632,176.84268326695343,8.8333333333333357]
["09:00:00",5.2499999999999998E-2,5.2499999999999998E-2,0.1,4.5829192247134415E-2,0.25813037308573467,180.69126116001425,9.0000000000000018]
["09:10:00",5.45E-2,5.45E-2,0.1,4.713062561687674E-2,0.26414759400115845,184.9033158008109,9.1666666666666679]
["09:20:00",5.7000000000000002E-2,5.7000000000000002E-2,0.1,4.7483110757413363E-2,0.27138456412646267,189.96919488852387,9.3333333333333339]
["09:30:00",5.9499999999999997E-2,5.9499999999999997E-2,0.1,4.7917842430741868E-2,0.28042701276011045,196.2989089320773,9.5]
["09:40:00",6.25E-2,6.25E-2,0.1,4.844657014154681E-2,0.29141369308627241,203.9895851603907,9.6666666666666661]
["09:50:00",6.5500000000000003E-2,6.5500000000000003E-2,0.1,4.9069293889828183E-2,0.30447832278711173,213.13482595097821,9.8333333333333321]
["10:00:00",6.9500000000000006E-2,6.9500000000000006E-2,0.1,4.9815387437297375E-2,0.31995631650405792,223.96942155284054,9.9999999999999982]
["10:10:00",7.3499999999999996E-2,7.3499999999999996E-2,0.1,5.0696600288638941E-2,0.33816546462151381,236.71582523505967,10.166666666666664]
["10:20:00",7.85E-2,7.85E-2,0.1,5.1718807196195156E-2,0.35941600427087061,251.59120298960943,10.33333333333333]
["10:30:00",8.4500000000000006E-2,8.4500000000000006E-2,0.1,5.2917256674019683E-2,0.38442911975506427,269.10038382854498,10.499999999999996]
["10:40:00",9.1499999999999998E-2,9.1499999999999998E-2,0.1,5.5164540604880102E-2,0.41353692092125005,289.47584464487505,10.666666666666663]
["10:50:00",0.1,0.1,0.1,5.8141553152994539E-2,0.44704859502501809,312.93401651751265,10.833333333333329]
["11:00:00",0.111,0.111,0.1,6.1412771536939401E-2,0.48623959872933209,340.36771911053245,{"$f":"H72+1/6","v":10.999999999999995}]
["11:10:00",0.1255,0.1255,0.1,6.5140454216411015E-2,0.53335964483503906,373.35175138452735,11.166666666666661]
["11:20:00",0.14499999999999999,0.14499999999999999,0.1,6.9479975034710845E-2,0.59159374658455821,414.11562260919078,11.333333333333327]
["11:30:00",0.17399999999999999,0.17399999999999999,0.1,7.4676940649156878E-2,0.66652649700575772,466.56854790403042,11.499999999999993]
["11:40:00",0.2225,0.2225,0.1,8.1290472188584692E-2,0.76961189150386855,538.72832405270799,11.666666666666659]
["11:50:00",0.32250000000000001,0.32250000000000001,0.1,9.0604407268310663E-2,0.92951408602234198,650.65986021563936,11.833333333333325]
["12:00:00",0.77800000000000002,0.77800000000000002,0.1,9.4422253028602465E-2,1,700,11.999999999999991]
["12:10:00",0.435,0.435,0.1,9.4422253028602465E-2,1,700,12.166666666666657]
["12:20:00",0.26150000000000001,0.26150000000000001,0.1,9.4422253028602465E-2,1,700,12.333333333333323]
["12:30:00",0.19450000000000001,0.19450000000000001,0.1,9.4422253028602465E-2,1,700,12.499999999999989]
["12:40:00",0.158,0.158,0.1,9.4422253028602465E-2,1,700,12.666666666666655]
["12:50:00",0.13450000000000001,0.13450000000000001,0.1,9.4422253028602465E-2,1,700,12.833333333333321]
["13:00:00",0.11799999999999999,0.11799999999999999,0.1,9.4422253028602465E-2,1,700,12.999999999999988]
["13:10:00",0.1055,0.1055,0.1,9.4422253028602465E-2,1,700,13.166666666666654]
["13:20:00",9.5500000000000002E-2,9.5500000000000002E-2,0.1,9.4422253028602465E-2,1,700,13.33333333333332]
["13:30:00",8.7999999999999995E-2,8.7999999999999995E-2,0.1,9.4279767426749775E-2,0.99730867110282151,698.11606977197505,13.499999999999986]
["13:40:00",8.1500000000000003E-2,8.1500000000000003E-2,0.1,9.3851012691264168E-2,0.98932405105224408,692.52683573657089,13.666666666666652]
["13:50:00",7.5999999999999998E-2,7.5999999999999998E-2,0.1,9.3177953589175022E-2,0.97666877978919875,683.66814585243912,13.833333333333318]
["14:00:00",7.1499999999999994E-2,7.1499999999999994E-2,0.1,9.2294977151679364E-2,0.96039466661454687,672.27626663018282,13.999999999999984]
["14:10:00",6.7500000000000004E-2,6.7500000000000004E-2,0.1,9.1256272435576588E-2,0.9413012739342943,658.910891754006,14.16666666666665]
["14:20:00",6.4000000000000001E-2,6.4000000000000001E-2,0.1,9.0076805239448235E-2,0.91994424064499791,643.9609684514985,14.333333333333316]
["14:30:00",6.0999999999999999E-2,6.0999999999999999E-2,0.1,8.8785383437362864E-2,0.89686044549779309,627.80231184845513,14.499999999999982]
["14:40:00",5.8000000000000003E-2,5.8000000000000003E-2,0.1,8.7398021268309659E-2,0.87235327205250479,610.64729043675334,14.666666666666648]
["14:50:00",5.6000000000000001E-2,5.6000000000000001E-2,0.1,8.5924295589429198E-2,0.8469294219706166,592.85059537943164,14.833333333333314]
["15:00:00",5.3499999999999999E-2,5.3499999999999999E-2,0.1,8.4388650117777728E-2,0.82086673095324225,574.60671166726956,14.99999999999998]
["15:10:00",5.1499999999999997E-2,5.1499999999999997E-2,0.1,8.2795020146454096E-2,0.79421658655428573,555.95161058799999,15.166666666666647]
["15:20:00",4.9500000000000002E-2,4.9500000000000002E-2,0.1,8.1155050067742152E-2,0.76723798503391583,537.06658952374107,15.333333333333313]
["15:30:00",4.8000000000000001E-2,4.8000000000000001E-2,0.1,7.9465870913485198E-2,0.74018616175624696,518.13031322937286,15.499999999999979]
["15:40:00",4.65E-2,4.65E-2,0.1,7.7755716384615023E-2,0.71330548148563255,499.31383703994277,15.666666666666645]
["15:50:00",4.4999999999999998E-2,4.4999999999999998E-2,0.1,7.6007093227742142E-2,0.68662142022319372,480.63499415623562,15.833333333333311]
["16:00:00",4.3499999999999997E-2,4.3499999999999997E-2,0.1,7.4250209529581487E-2,0.66015400475576935,462.10780332903852,15.999999999999977]
["16:10:00",4.2500000000000003E-2,4.2500000000000003E-2,0.1,7.2467601804860754E-2,0.63413208561243695,443.89245992870588,16.166666666666643]
["16:20:00",4.1500000000000002E-2,4.1500000000000002E-2,0.1,7.0700552078301268E-2,0.60877430537679611,426.14201376375729,16.333333333333311]
["16:30:00",0.04,0.04,0.1,6.891479717638932E-2,0.58386772712478585,408.70740898735011,16.499999999999979]
["16:40:00",3.9E-2,3.9E-2,0.1,6.7117949010374531E-2,0.55942512161617275,391.59758513132095,16.666666666666647]
["16:50:00",3.85E-2,3.85E-2,0.1,6.5337155933842289E-2,0.53587293378293699,375.11105364805593,16.833333333333314]
["17:00:00",3.7499999999999999E-2,3.7499999999999999E-2,0.1,6.3573767139873325E-2,0.51319682389420185,359.23777672594127,16.999999999999982]
["17:10:00",3.6499999999999998E-2,3.6499999999999998E-2,0.1,6.1819387710503569E-2,0.49117118610118315,343.81983027082822,17.16666666666665]
["17:20:00",3.5499999999999997E-2,3.5499999999999997E-2,0.1,6.0054459694999805E-2,0.46979668007025316,328.8576760491772,17.333333333333318]
["17:30:00",3.5000000000000003E-2,3.5000000000000003E-2,0.1,5.8319951725248356E-2,0.44927907517586108,314.49535262310275,17.499999999999986]
["17:40:00",3.4000000000000002E-2,3.4000000000000002E-2,0.1,5.6618659617058989E-2,0.42959109888630076,300.71376922041054,17.666666666666654]
["17:50:00",3.3500000000000002E-2,3.3500000000000002E-2,0.1,5.4909171075873522E-2,0.41072202858932971,287.50542001253081,17.833333333333321]
["18:00:00",3.3000000000000002E-2,3.3000000000000002E-2,0.1,5.3322614585636807E-2,0.39283697759153952,274.98588431407768,17.999999999999989]
["18:10:00",3.2500000000000001E-2,3.2500000000000001E-2,0.1,5.248839975303346E-2,0.37556082858925233,262.89258001247663,18.166666666666657]
["18:20:00",3.15E-2,3.15E-2,0.1,5.1665934425114662E-2,0.35835182822718886,250.8462797590322,18.333333333333325]
["18:30:00",3.1E-2,3.1E-2,0.1,5.083759434485359E-2,0.34120745875434533,238.84522112804171,18.499999999999993]
["18:40:00",3.0499999999999999E-2,3.0499999999999999E-2,0.1,5.0026878521619349E-2,0.3243369703829998,227.03587926809985,18.666666666666661]
["18:50:00",0.03,0.03,0.1,4.9227912203069664E-2,0.30772777435813309,215.40944205069314,18.833333333333329]
["19:00:00",2.9499999999999998E-2,2.9499999999999998E-2,0.1,4.8440695389204529E-2,0.29136979967572985,203.95885977301089,18.999999999999996]
["19:10:00",2.9000000000000001E-2,2.9000000000000001E-2,0.1,4.7665228080023957E-2,0.27525297533177479,192.67708273224235,19.166666666666664]
["19:20:00",2.8500000000000001E-2,2.8500000000000001E-2,0.1,4.6219780645880455E-2,0.25965940016353006,181.76158011447103,19.333333333333332]
["19:30:00",2.8000000000000001E-2,2.8000000000000001E-2,0.1,4.2585901427066246E-2,0.24581410784655289,172.06987549258702,19.5]
["19:40:00",2.75E-2,2.75E-2,0.1,3.9639529247486323E-2,0.23436035184317319,164.05224629022123,19.666666666666668]
["19:50:00",2.75E-2,2.75E-2,0.1,3.7279033821234916E-2,0.22496668195657837,157.47667736960486,19.833333333333336]
["20:00:00",2.7E-2,2.7E-2,0.1,3.5354163602763646E-2,0.21719531163200753,152.03671814240528,20.000000000000004]
["20:10:00",2.6499999999999999E-2,2.6499999999999999E-2,0.1,3.3727374691408622E-2,0.2105175095059337,147.36225665415358,20.166666666666671]
["20:20:00",2.5999999999999999E-2,2.5999999999999999E-2,0.1,3.2357595311253325E-2,0.20469537950479286,143.28676565335499,20.333333333333339]
["20:30:00",2.5999999999999999E-2,2.5999999999999999E-2,0.1,3.1178239885015745E-2,0.19975145013496323,139.82601509447426,20.500000000000007]
["20:40:00",2.5499999999999998E-2,2.5499999999999998E-2,0.1,3.0211369517054644E-2,0.19551304610550449,136.85913227385313,20.666666666666675]
["20:50:00",2.5000000000000001E-2,2.5000000000000001E-2,0.1,2.931069550392781E-2,0.1916464468107977,134.15251276755839,20.833333333333343]
["21:00:00",2.5000000000000001E-2,2.5000000000000001E-2,0.1,2.8530094209751687E-2,0.1882861083620779,131.80027585345454,21.000000000000011]
["21:10:00",2.4500000000000001E-2,2.4500000000000001E-2,0.1,2.7866620454722164E-2,0.18533037350587481,129.73126145411237,21.166666666666679]
["21:20:00",2.4E-2,2.4E-2,0.1,2.7235693250310038E-2,0.18250081048943245,127.75056734260271,21.333333333333346]
["21:30:00",2.4E-2,2.4E-2,0.1,2.6663850796217373E-2,0.17997243446949213,125.98070412864449,21.500000000000014]
["21:40:00",2.35E-2,2.35E-2,0.1,2.6176929758689946E-2,0.17768352851738897,124.37846996217229,{"$f":"H136+1/6","v":21.666666666666682}]
["21:50:00",2.35E-2,2.35E-2,0.1,2.5693009309244137E-2,0.17559641177398869,122.91748824179207,21.83333333333335]
["22:00:00",2.3E-2,2.3E-2,0.1,2.5292047880402676E-2,0.17367424440699716,121.57197108489802,22.000000000000018]
["22:10:00",2.3E-2,2.3E-2,0.1,2.4893194210757183E-2,0.17188056922507153,120.31639845755006,22.166666666666686]
["22:20:00",2.2499999999999999E-2,2.2499999999999999E-2,0.1,2.452284232885827E-2,0.17020226785095061,119.14158749566543,22.333333333333353]
["22:30:00",2.2499999999999999E-2,2.2499999999999999E-2,0.1,2.4206874005831252E-2,0.16860381799322655,118.02267259525858,22.500000000000021]
["22:40:00",2.1999999999999999E-2,2.1999999999999999E-2,0.1,2.3839974759199654E-2,0.16708373995107045,116.95861796574931,22.666666666666689]
["22:50:00",2.1999999999999999E-2,2.1999999999999999E-2,0.1,2.3553010010792991E-2,0.1656296036210736,115.94072253475152,22.833333333333357]
["23:00:00",2.1499999999999998E-2,2.1499999999999998E-2,0.1,2.3267206002888355E-2,0.16420665390092445,114.94465773064711,23.000000000000025]
["23:10:00",2.1499999999999998E-2,2.1499999999999998E-2,0.1,2.2956749195785983E-2,0.1628249588157783,113.97747117104481,23.166666666666693]
["23:20:00",2.1000000000000001E-2,2.1000000000000001E-2,0.1,2.2673387554995528E-2,0.16148347163687193,113.03843014581035,23.333333333333361]
["23:30:00",2.1000000000000001E-2,2.1000000000000001E-2,0.1,2.2391201475377254E-2,0.16017007633814073,112.11905343669852,23.500000000000028]
["23:40:00",2.0500000000000001E-2,2.0500000000000001E-2,0.1,2.2135692927832053E-2,0.15887283587962248,111.21098511573572,23.666666666666696]
["23:50:00",2.0500000000000001E-2,2.0500000000000001E-2,0.1,2.1855764809855363E-2,0.1575907825634707,110.3135477944295,23.833333333333364]
[1,2.0500000000000001E-2,2.0500000000000001E-2,0.1,2.1627617639061233E-2,0.15652647579964932,109.56853305975451,24.000000000000032]